BDBM53505 (3-methyl-5-phenylmethoxy-1H-indol-2-yl)-(4-morpholinyl)methanone::(3-methyl-5-phenylmethoxy-1H-indol-2-yl)-morpholin-4-yl-methanone::(3-methyl-5-phenylmethoxy-1H-indol-2-yl)-morpholin-4-ylmethanone::(5-Benzyloxy-3-methyl-1H-indol-2-yl)-morpholin-4-yl-methanone::(5-benzoxy-3-methyl-1H-indol-2-yl)-morpholino-methanone::MLS000072969::SMR000010576::cid_651145
SMILES Cc1c([nH]c2ccc(OCc3ccccc3)cc12)C(=O)N1CCOCC1
InChI Key InChIKey=QDPVAKMAFHOZNR-UHFFFAOYSA-N
Data  1 IC50
  Tab Delimited (TSV)   2D SDfile   Computed 3D by Vconf -m prep SDfile
Find this compound or compounds like it in BindingDB:
Activity Spreadsheet -- Enzyme Inhibition Constant Data from BindingDB
Found 1 hit for monomerid = 53505
TargetTyrosine-protein phosphatase non-receptor type 7(Homo sapiens (Human))
Burnham Center For Chemical Genomics
Curated by PubChem BioAssay
LigandPNGBDBM53505((3-methyl-5-phenylmethoxy-1H-indol-2-yl)-(4-morpho...)
Affinity DataIC50:  1.00E+5nM. Assay description: Data Source: Sanford-Burnham Center for Chemical Genomics (SBCCG) Source Affiliation: Sanford-Burnham Medical Research Institute (SBMRI, San Diego, C...
In DepthDetails PCBioAssay