BDBM53511 7-(4-Fluoro-benzyl)-1,3-dimethyl-8-(pyridin-3-ylmethylsulfanyl)-3,7-dihydro-purine-2,6-dione::7-(4-fluorobenzyl)-1,3-dimethyl-8-(3-pyridylmethylthio)xanthine::7-[(4-fluorophenyl)methyl]-1,3-dimethyl-8-(3-pyridinylmethylthio)purine-2,6-dione::7-[(4-fluorophenyl)methyl]-1,3-dimethyl-8-(pyridin-3-ylmethylsulfanyl)purine-2,6-dione::MLS000035874::SMR000003397::cid_656259
SMILES Cn1c2nc(SCc3cccnc3)n(Cc3ccc(F)cc3)c2c(=O)n(C)c1=O
InChI Key InChIKey=GPISGNSHSLFUFB-UHFFFAOYSA-N
Data  1 IC50
  Tab Delimited (TSV)   2D SDfile   Computed 3D by Vconf -m prep SDfile
Find this compound or compounds like it in BindingDB:
Activity Spreadsheet -- Enzyme Inhibition Constant Data from BindingDB
Found 1 hit for monomerid = 53511
TargetTyrosine-protein phosphatase non-receptor type 7(Homo sapiens (Human))
Burnham Center For Chemical Genomics
Curated by PubChem BioAssay
LigandPNGBDBM53511(7-(4-Fluoro-benzyl)-1,3-dimethyl-8-(pyridin-3-ylme...)
Affinity DataIC50:  1.00E+5nM. Assay description: Data Source: Sanford-Burnham Center for Chemical Genomics (SBCCG) Source Affiliation: Sanford-Burnham Medical Research Institute (SBMRI, San Diego, C...
In DepthDetails PCBioAssay