BDBM53561 4-bromanyl-N-methyl-N-[(3-pyridin-3-yl-1,2,4-oxadiazol-5-yl)methyl]benzenesulfonamide::4-bromo-N-methyl-N-[(3-pyridin-3-yl-1,2,4-oxadiazol-5-yl)methyl]benzenesulfonamide::4-bromo-N-methyl-N-[[3-(3-pyridinyl)-1,2,4-oxadiazol-5-yl]methyl]benzenesulfonamide::4-bromo-N-methyl-N-[[3-(3-pyridyl)-1,2,4-oxadiazol-5-yl]methyl]benzenesulfonamide::4-bromo-N-methyl-N-{[3-(3-pyridinyl)-1,2,4-oxadiazol-5-yl]methyl}benzenesulfonamide::MLS000052418::SMR000081804::cid_1253803
SMILES CN(Cc1nc(no1)-c1cccnc1)S(=O)(=O)c1ccc(Br)cc1
InChI Key InChIKey=OQQDPTRHISUGHN-UHFFFAOYSA-N
Data  1 IC50
  Tab Delimited (TSV)   2D SDfile   Computed 3D by Vconf -m prep SDfile
Find this compound or compounds like it in BindingDB:
Activity Spreadsheet -- Enzyme Inhibition Constant Data from BindingDB
Found 1 hit for monomerid = 53561
TargetTyrosine-protein phosphatase non-receptor type 7(Homo sapiens (Human))
Burnham Center For Chemical Genomics
Curated by PubChem BioAssay
LigandPNGBDBM53561(4-bromanyl-N-methyl-N-[(3-pyridin-3-yl-1,2,4-oxadi...)
Affinity DataIC50:  1.00E+5nM. Assay description: Data Source: Sanford-Burnham Center for Chemical Genomics (SBCCG) Source Affiliation: Sanford-Burnham Medical Research Institute (SBMRI, San Diego, C...
In DepthDetails PCBioAssay