BDBM53578 MLS000103771::N-(4-methoxy-3-prop-2-ynyl-1,3-benzothiazol-2-ylidene)-2-thiophenecarboxamide::N-(4-methoxy-3-prop-2-ynyl-1,3-benzothiazol-2-ylidene)thiophene-2-carboxamide::N-(4-methoxy-3-propargyl-1,3-benzothiazol-2-ylidene)thiophene-2-carboxamide::SMR000017825::cid_2151298
SMILES COc1cccc2s\c(=N/C(=O)c3cccs3)n(CC#C)c12
InChI Key InChIKey=DAMRJQZZDSXAHP-MSUUIHNZSA-N
Data  3 IC50
  Tab Delimited (TSV)   2D SDfile   Computed 3D by Vconf -m prep SDfile
Find this compound or compounds like it in BindingDB:
Activity Spreadsheet -- Enzyme Inhibition Constant Data from BindingDB
Found 3 hits for monomerid = 53578
TargetTyrosine-protein phosphatase non-receptor type 7(Homo sapiens (Human))
Burnham Center For Chemical Genomics
Curated by PubChem BioAssay
LigandPNGBDBM53578(MLS000103771 | N-(4-methoxy-3-prop-2-ynyl-1,3-benz...)
Affinity DataIC50:  1.00E+5nM. Assay description: Data Source: Sanford-Burnham Center for Chemical Genomics (SBCCG) Source Affiliation: Sanford-Burnham Medical Research Institute (SBMRI, San Diego, C...
In DepthDetails PCBioAssay
Target26S proteasome non-ATPase regulatory subunit 14(Homo sapiens (Human))
Burnham Center For Chemical Genomics
Curated by PubChem BioAssay
LigandPNGBDBM53578(MLS000103771 | N-(4-methoxy-3-prop-2-ynyl-1,3-benz...)
Affinity DataIC50:  2.49E+4nM. Assay description: Data Source: Sanford-Burnham Center for Chemical Genomics (SBCCG) Source Affiliation: Sanford Burnham Medical Research Institute (SBMRI, La Jolla, CA...
In DepthDetails PCBioAssay
TargetProthrombin(Bos taurus (Bovine))
Burnham Center For Chemical Genomics
Curated by PubChem BioAssay
LigandPNGBDBM53578(MLS000103771 | N-(4-methoxy-3-prop-2-ynyl-1,3-benz...)
Affinity DataIC50: >1.00E+5nM. Assay description: Data Source: Sanford-Burnham Center for Chemical Genomics (SBCCG) Source Affiliation: Sanford Burnham Medical Research Institute (SBMRI, La Jolla, CA...
In DepthDetails PCBioAssay