BDBM53588 2,3-dihydro-1H-benzo[g]quinolin-4-one::2,3-dihydrobenzo[g]quinolin-4(1H)-one::MLS000058840::SMR000069106::cid_607541
SMILES O=C1CCNc2cc3ccccc3cc12
InChI Key InChIKey=AIBRSQPCCIXKIF-UHFFFAOYSA-N
Data  1 IC50
  Tab Delimited (TSV)   2D SDfile   Computed 3D by Vconf -m prep SDfile
Find this compound or compounds like it in BindingDB:
Activity Spreadsheet -- Enzyme Inhibition Constant Data from BindingDB
Found 1 hit for monomerid = 53588
TargetMannose-6-phosphate isomerase(Homo sapiens (Human))
Sanford-Burnham Center For Chemical Genomics
Curated by PubChem BioAssay
LigandPNGBDBM53588(2,3-dihydro-1H-benzo[g]quinolin-4-one | 2,3-dihydr...)
Affinity DataIC50:  2.32E+4nM. Assay description: Data Source: Sanford-Burnham Center for Chemical Genomics (SBCCG) Source Affiliation: Sanford-Burnham Medical Research Institute (SBMRI, San Diego, C...
In DepthDetails PCBioAssay