BDBM53589 3-hydroxy-N-(2-hydroxyethyl)-2-naphthalenecarboxamide::3-hydroxy-N-(2-hydroxyethyl)-2-naphthamide::3-hydroxy-N-(2-hydroxyethyl)naphthalene-2-carboxamide::MLS000061208::N-(2-hydroxyethyl)-3-oxidanyl-naphthalene-2-carboxamide::SMR000069276::cid_66722
SMILES OCCNC(=O)c1cc2ccccc2cc1O
InChI Key InChIKey=VYHNSPUVKZPCDZ-UHFFFAOYSA-N
Data  1 IC50
  Tab Delimited (TSV)   2D SDfile   Computed 3D by Vconf -m prep SDfile
Find this compound or compounds like it in BindingDB:
Activity Spreadsheet -- Enzyme Inhibition Constant Data from BindingDB
Found 1 hit for monomerid = 53589
TargetMannose-6-phosphate isomerase(Homo sapiens (Human))
Sanford-Burnham Center For Chemical Genomics
Curated by PubChem BioAssay
LigandPNGBDBM53589(3-hydroxy-N-(2-hydroxyethyl)-2-naphthalenecarboxam...)
Affinity DataIC50:  5.00E+4nM. Assay description: Data Source: Sanford-Burnham Center for Chemical Genomics (SBCCG) Source Affiliation: Sanford-Burnham Medical Research Institute (SBMRI, San Diego, C...
In DepthDetails PCBioAssay