BDBM53608 MLS000564022::N-(N'-Acetyl-hydrazinocarbothioyl)-3-nitro-benzamide::N-(acetamidocarbamothioyl)-3-nitro-benzamide::N-(acetamidocarbamothioyl)-3-nitrobenzamide::N-(acetamidothiocarbamoyl)-3-nitro-benzamide::N-[(acetylhydrazo)-sulfanylidenemethyl]-3-nitrobenzamide::SMR000177386::cid_3138345
SMILES CC(=O)NNC(=S)NC(=O)c1cccc(c1)[N+]([O-])=O
InChI Key InChIKey=IMQLJHIBYUNQRP-UHFFFAOYSA-N
Data  2 IC50
  Tab Delimited (TSV)   2D SDfile   Computed 3D by Vconf -m prep SDfile
Find this compound or compounds like it in BindingDB:
Activity Spreadsheet -- Enzyme Inhibition Constant Data from BindingDB
Found 2 hits for monomerid = 53608
TargetM17 leucyl aminopeptidase(Plasmodium falciparum 3D7)
Srmlsc
Curated by PubChem BioAssay
LigandPNGBDBM53608(MLS000564022 | N-(N'-Acetyl-hydrazinocarbothio...)
Affinity DataIC50:  4.58E+4nM. Assay description: Southern Research Molecular Libraries Screening Center (SRMLSC) Southern Research Institute (Birmingham, Alabama) NIH Molecular Libraries Screening...
In DepthDetails PCBioAssay
TargetMannose-6-phosphate isomerase(Homo sapiens (Human))
Sanford-Burnham Center For Chemical Genomics
Curated by PubChem BioAssay
LigandPNGBDBM53608(MLS000564022 | N-(N'-Acetyl-hydrazinocarbothio...)
Affinity DataIC50:  5.00E+4nM. Assay description: Data Source: Sanford-Burnham Center for Chemical Genomics (SBCCG) Source Affiliation: Sanford-Burnham Medical Research Institute (SBMRI, San Diego, C...
In DepthDetails PCBioAssay