BDBM53804 4-({2-[(1,3-dioxo-1,3-dihydro-2H-inden-2-ylidene)methyl]phenoxy}methyl)benzoic acid::4-[[2-[(1,3-diketoindan-2-ylidene)methyl]phenoxy]methyl]benzoic acid::4-[[2-[(1,3-dioxo-2-indenylidene)methyl]phenoxy]methyl]benzoic acid::4-[[2-[(1,3-dioxoinden-2-ylidene)methyl]phenoxy]methyl]benzoic acid::4-[[2-[[1,3-bis(oxidanylidene)inden-2-ylidene]methyl]phenoxy]methyl]benzoic acid::MLS000574767::SMR000196200::cid_1209375
SMILES [#8]-[#6](=O)-c1ccc(-[#6]-[#8]-c2ccccc2\[#6]=[#6]-2\[#6](=O)-c3ccccc3-[#6]-2=O)cc1
InChI Key InChIKey=NRIDPHPNVUPLOD-UHFFFAOYSA-N
Data  6 IC50  1 EC50
PDB links: 1 PDB ID matches this monomer.
  Tab Delimited (TSV)   2D SDfile   Computed 3D by Vconf -m prep SDfile
Find this compound or compounds like it in BindingDB:
Activity Spreadsheet -- Enzyme Inhibition Constant Data from BindingDB
Found 7 hits for monomerid = 53804
TargetM1 family aminopeptidase(Plasmodium falciparum (isolate FcB1 / Columbia))
Srmlsc
Curated by PubChem BioAssay
LigandPNGBDBM53804(4-({2-[(1,3-dioxo-1,3-dihydro-2H-inden-2-ylidene)m...)
Affinity DataIC50:  7.49E+4nM. Assay description: Southern Research Molecular Libraries Screening Center (SRMLSC) Southern Research Institute (Birmingham, Alabama) NIH Molecular Libraries Screening...
In DepthDetails PCBioAssay
TargetCarboxy-terminal domain RNA polymerase II polypeptide A small phosphatase 1(Homo sapiens (Human))
Burnham Center For Chemical Genomics
Curated by PubChem BioAssay
LigandPNGBDBM53804(4-({2-[(1,3-dioxo-1,3-dihydro-2H-inden-2-ylidene)m...)
Affinity DataIC50:  5.86E+3nM. Assay description: Data Source: Sanford-Burnham Center for Chemical Genomics (SBCCG) Source Affiliation: Sanford-Burnham Medical Research Institute (SBMRI, San Diego, C...
In DepthDetails PCBioAssay
TargetProthrombin(Bos taurus (Bovine))
Burnham Center For Chemical Genomics
Curated by PubChem BioAssay
LigandPNGBDBM53804(4-({2-[(1,3-dioxo-1,3-dihydro-2H-inden-2-ylidene)m...)
Affinity DataIC50: >1.00E+5nM. Assay description: Data Source: Sanford-Burnham Center for Chemical Genomics (SBCCG) Source Affiliation: Sanford Burnham Medical Research Institute (SBMRI, La Jolla, CA...
In DepthDetails PCBioAssay
TargetPeroxisome proliferator-activated receptor gamma(Homo sapiens (Human))
Universidade Federal Do Abc
Curated by ChEMBL
LigandPNGBDBM53804(4-({2-[(1,3-dioxo-1,3-dihydro-2H-inden-2-ylidene)m...)
Affinity DataIC50:  1.14E+3nM. Assay description: Displacement of fluormone from human PPARgamma LBD expressed in Escherichia coli BL21 DE3 by fluorescence polarization assay
TargetCorticotropin-releasing factor-binding protein(Homo sapiens (Human))
Burnham Center For Chemical Genomics
Curated by PubChem BioAssay
LigandPNGBDBM53804(4-({2-[(1,3-dioxo-1,3-dihydro-2H-inden-2-ylidene)m...)
Affinity DataEC50:  1.00E+4nM. Assay description: Data Source: Sanford-Burnham Center for Chemical Genomics (SBCCG) Source Affiliation: Sanford-Burnham Medical Research Institute (SBMRI, San Diego, C...
In DepthDetails PCBioAssay
TargetCorticotropin-releasing factor-binding protein(Homo sapiens (Human))
Burnham Center For Chemical Genomics
Curated by PubChem BioAssay
LigandPNGBDBM53804(4-({2-[(1,3-dioxo-1,3-dihydro-2H-inden-2-ylidene)m...)
Affinity DataIC50:  1.47E+3nM
In DepthDetails PCBioAssay
Target26S proteasome non-ATPase regulatory subunit 14(Homo sapiens (Human))
Burnham Center For Chemical Genomics
Curated by PubChem BioAssay
LigandPNGBDBM53804(4-({2-[(1,3-dioxo-1,3-dihydro-2H-inden-2-ylidene)m...)
Affinity DataIC50:  1.71E+4nM. Assay description: Data Source: Sanford-Burnham Center for Chemical Genomics (SBCCG) Source Affiliation: Sanford Burnham Medical Research Institute (SBMRI, La Jolla, CA...
In DepthDetails PCBioAssay