BDBM54374 (5Z)-5-[[1-(4-hydroxyphenyl)-2,5-dimethyl-3-pyrrolyl]methylidene]-3-methyl-2-sulfanylidene-4-thiazolidinone::(5Z)-5-[[1-(4-hydroxyphenyl)-2,5-dimethyl-pyrrol-3-yl]methylene]-3-methyl-2-thioxo-thiazolidin-4-one::(5Z)-5-[[1-(4-hydroxyphenyl)-2,5-dimethyl-pyrrol-3-yl]methylidene]-3-methyl-2-sulfanylidene-1,3-thiazolidin-4-one::(5Z)-5-[[1-(4-hydroxyphenyl)-2,5-dimethylpyrrol-3-yl]methylidene]-3-methyl-2-sulfanylidene-1,3-thiazolidin-4-one::5-[1-[1-(4-Hydroxy-phenyl)-2,5-dimethyl-1H-pyrrol-3-yl]-meth-(Z)-ylidene]-3-methyl-2-thioxo-thiazolidin-4- one::MLS000779144::SMR000415847::cid_1967479
SMILES CN1C(=S)S\C(=C/c2cc(C)n(c2C)-c2ccc(O)cc2)C1=O
InChI Key InChIKey=XDOKLSJPKKDTBH-DHDCSXOGSA-N
Data  5 IC50  3 EC50
  Tab Delimited (TSV)   2D SDfile   Computed 3D by Vconf -m prep SDfile
Find this compound or compounds like it in BindingDB:
Activity Spreadsheet -- Enzyme Inhibition Constant Data from BindingDB
Found 8 hits for monomerid = 54374
TargetNucleotide-binding oligomerization domain-containing protein 2(Homo sapiens (Human))
Burnham Center For Chemical Genomics
Curated by PubChem BioAssay
LigandPNGBDBM54374((5Z)-5-[[1-(4-hydroxyphenyl)-2,5-dimethyl-3-pyrrol...)
Affinity DataIC50:  6.54E+3nM. Assay description: Data Source: Sanford-Burnham Center for Chemical Genomics (SBCCG) Source Affiliation: Sanford-Burnham Medical Research Institute (SBMRI, San Diego, C...
In DepthDetails PCBioAssay
TargetStreptokinase A(Streptococcus pyogenes M1 GAS)
Broad Institute
Curated by PubChem BioAssay
LigandPNGBDBM54374((5Z)-5-[[1-(4-hydroxyphenyl)-2,5-dimethyl-3-pyrrol...)
Affinity DataEC50:  1.50E+5nM. Assay description: Keywords: Group A streptococcus, GAS, streptokinase, expression, virulence, inhibition, dose response, EC50 Assay Overview: The goal of this assa...
In DepthDetails PCBioAssay
TargetNucleotide-binding oligomerization domain-containing protein 1(Homo sapiens (Human))
Burnham Center For Chemical Genomics
Curated by PubChem BioAssay
LigandPNGBDBM54374((5Z)-5-[[1-(4-hydroxyphenyl)-2,5-dimethyl-3-pyrrol...)
Affinity DataEC50:  9.47E+3nM. Assay description: Data Source: Sanford-Burnham Center for Chemical Genomics (SBCCG) Source Affiliation: Sanford-Burnham Medical Research Institute (SBMRI, San Diego, C...
In DepthDetails PCBioAssay
TargetDelta-type opioid receptor(Homo sapiens (Human))
The Scripps Research Institute Molecular Screening Center
Curated by PubChem BioAssay
LigandPNGBDBM54374((5Z)-5-[[1-(4-hydroxyphenyl)-2,5-dimethyl-3-pyrrol...)
Affinity DataEC50:  1.51E+4nM. Assay description: Source (MLPCN Center Name): The Scripps Research Institute Molecular Screening Center (SRIMSC) Affiliation: The Scripps Research Institute, TSRI Assa...
In DepthDetails PCBioAssay
TargetCaspase-3(Homo sapiens (Human))
Burnham Center For Chemical Genomics
Curated by PubChem BioAssay
LigandPNGBDBM54374((5Z)-5-[[1-(4-hydroxyphenyl)-2,5-dimethyl-3-pyrrol...)
Affinity DataIC50:  2.19E+4nM. Assay description: Data Source: Sanford-Burnham Center for Chemical Genomics (SBCCG) Source Affiliation: Sanford-Burnham Medical Research Institute (SBMRI, San Diego, C...
In DepthDetails PCBioAssay
TargetSentrin-specific protease 8(Homo sapiens (Human))
Burnham Center For Chemical Genomics
Curated by PubChem BioAssay
LigandPNGBDBM54374((5Z)-5-[[1-(4-hydroxyphenyl)-2,5-dimethyl-3-pyrrol...)
Affinity DataIC50:  8.79E+3nM. Assay description: Data Source: Sanford-Burnham Center for Chemical Genomics (SBCCG) Source Affiliation: Sanford-Burnham Medical Research Institute (SBMRI, San Diego, C...
In DepthDetails PCBioAssay
TargetSentrin-specific protease 6(Homo sapiens (Human))
Burnham Center For Chemical Genomics
Curated by PubChem BioAssay
LigandPNGBDBM54374((5Z)-5-[[1-(4-hydroxyphenyl)-2,5-dimethyl-3-pyrrol...)
Affinity DataIC50:  4.66E+3nM. Assay description: Data Source: Sanford-Burnham Center for Chemical Genomics (SBCCG) Source Affiliation: Sanford-Burnham Medical Research Institute (SBMRI, San Diego, C...
In DepthDetails PCBioAssay
TargetTumor necrosis factor(Homo sapiens (Human))
Burnham Center For Chemical Genomics
Curated by PubChem BioAssay
LigandPNGBDBM54374((5Z)-5-[[1-(4-hydroxyphenyl)-2,5-dimethyl-3-pyrrol...)
Affinity DataIC50:  345nM. Assay description: Data Source: Sanford-Burnham Center for Chemical Genomics (SBCCG) Source Affiliation: Sanford-Burnham Medical Research Institute (SBMRI, San Diego, C...
In DepthDetails PCBioAssay