BDBM54385 5-[8-Ethyl-4,4,6-trimethyl-2-oxo-5,6-dihydro-4H-pyrrolo[3,2,1-ij]quinolin-(1Z)-ylidene]-thiazolidine-2,4-di one::MLS000775978::SMR000439992::cid_16442194
SMILES CCc1cc2\C(C(=O)N3c2c(c1)C(C)CC3(C)C)=C1\SC(=O)NC1=O
InChI Key InChIKey=CECRRJPNIQVAGG-SQFISAMPSA-N
Data  5 IC50  1 EC50
  Tab Delimited (TSV)   2D SDfile   Computed 3D by Vconf -m prep SDfile
Find this compound or compounds like it in BindingDB:
Activity Spreadsheet -- Enzyme Inhibition Constant Data from BindingDB
Found 6 hits for monomerid = 54385
TargetNucleotide-binding oligomerization domain-containing protein 2(Homo sapiens (Human))
Burnham Center For Chemical Genomics
Curated by PubChem BioAssay
LigandPNGBDBM54385(5-[8-Ethyl-4,4,6-trimethyl-2-oxo-5,6-dihydro-4H-py...)
Affinity DataIC50:  1.08E+4nM. Assay description: Data Source: Sanford-Burnham Center for Chemical Genomics (SBCCG) Source Affiliation: Sanford-Burnham Medical Research Institute (SBMRI, San Diego, C...
In DepthDetails PCBioAssay
TargetNucleotide-binding oligomerization domain-containing protein 1(Homo sapiens (Human))
Burnham Center For Chemical Genomics
Curated by PubChem BioAssay
LigandPNGBDBM54385(5-[8-Ethyl-4,4,6-trimethyl-2-oxo-5,6-dihydro-4H-py...)
Affinity DataEC50:  7.46E+3nM. Assay description: Data Source: Sanford-Burnham Center for Chemical Genomics (SBCCG) Source Affiliation: Sanford-Burnham Medical Research Institute (SBMRI, San Diego, C...
In DepthDetails PCBioAssay
TargetTumor necrosis factor(Homo sapiens (Human))
Burnham Center For Chemical Genomics
Curated by PubChem BioAssay
LigandPNGBDBM54385(5-[8-Ethyl-4,4,6-trimethyl-2-oxo-5,6-dihydro-4H-py...)
Affinity DataIC50:  2.00E+4nM. Assay description: Data Source: Sanford-Burnham Center for Chemical Genomics (SBCCG) Source Affiliation: Sanford-Burnham Medical Research Institute (SBMRI, San Diego, C...
In DepthDetails PCBioAssay
TargetNucleotide-binding oligomerization domain-containing protein 2(Homo sapiens (Human))
Burnham Center For Chemical Genomics
Curated by PubChem BioAssay
LigandPNGBDBM54385(5-[8-Ethyl-4,4,6-trimethyl-2-oxo-5,6-dihydro-4H-py...)
Affinity DataIC50:  5.90E+3nM. Assay description: Data Source: Sanford-Burnham Center for Chemical Genomics (SBCCG) Source Affiliation: Sanford-Burnham Medical Research Institute (SBMRI, San Diego, C...
In DepthDetails PCBioAssay
TargetTumor necrosis factor(Homo sapiens (Human))
Burnham Center For Chemical Genomics
Curated by PubChem BioAssay
LigandPNGBDBM54385(5-[8-Ethyl-4,4,6-trimethyl-2-oxo-5,6-dihydro-4H-py...)
Affinity DataIC50:  8.16E+3nM. Assay description: Data Source: Sanford-Burnham Center for Chemical Genomics (SBCCG) Source Affiliation: Sanford-Burnham Medical Research Institute (SBMRI, San Diego, C...
In DepthDetails PCBioAssay
TargetNucleotide-binding oligomerization domain-containing protein 1(Homo sapiens (Human))
Burnham Center For Chemical Genomics
Curated by PubChem BioAssay
LigandPNGBDBM54385(5-[8-Ethyl-4,4,6-trimethyl-2-oxo-5,6-dihydro-4H-py...)
Affinity DataIC50:  5.04E+3nM. Assay description: Data Source: Sanford-Burnham Center for Chemical Genomics (SBCCG) Source Affiliation: Sanford-Burnham Medical Research Institute (SBMRI, San Diego, C...
In DepthDetails PCBioAssay