BDBM54412 1-[1-(2-Fluoro-benzyl)-1H-indol-3-yl]-ethanone::1-[1-(2-fluorobenzyl)indol-3-yl]ethanone::1-[1-[(2-fluorophenyl)methyl]-3-indolyl]ethanone::1-[1-[(2-fluorophenyl)methyl]indol-3-yl]ethanone::MLS001205533::SMR000524010::cid_951679
SMILES CC(=O)c1cn(Cc2ccccc2F)c2ccccc12
InChI Key InChIKey=WKSVLPBAFHISLO-UHFFFAOYSA-N
Data  4 IC50  1 EC50
  Tab Delimited (TSV)   2D SDfile   Computed 3D by Vconf -m prep SDfile
Find this compound or compounds like it in BindingDB:
Activity Spreadsheet -- Enzyme Inhibition Constant Data from BindingDB
Found 5 hits for monomerid = 54412
TargetNucleotide-binding oligomerization domain-containing protein 2(Homo sapiens (Human))
Burnham Center For Chemical Genomics
Curated by PubChem BioAssay
LigandPNGBDBM54412(1-[1-(2-Fluoro-benzyl)-1H-indol-3-yl]-ethanone | 1...)
Affinity DataIC50:  5.00E+3nM. Assay description: Data Source: Sanford-Burnham Center for Chemical Genomics (SBCCG) Source Affiliation: Sanford-Burnham Medical Research Institute (SBMRI, San Diego, C...
In DepthDetails PCBioAssay
TargetNucleotide-binding oligomerization domain-containing protein 1(Homo sapiens (Human))
Burnham Center For Chemical Genomics
Curated by PubChem BioAssay
LigandPNGBDBM54412(1-[1-(2-Fluoro-benzyl)-1H-indol-3-yl]-ethanone | 1...)
Affinity DataEC50:  2.96E+3nM. Assay description: Data Source: Sanford-Burnham Center for Chemical Genomics (SBCCG) Source Affiliation: Sanford-Burnham Medical Research Institute (SBMRI, San Diego, C...
In DepthDetails PCBioAssay
TargetProtein Wnt-3a(Mus musculus)
Burnham Center For Chemical Genomics
Curated by PubChem BioAssay
LigandPNGBDBM54412(1-[1-(2-Fluoro-benzyl)-1H-indol-3-yl]-ethanone | 1...)
Affinity DataIC50:  491nM
In DepthDetails PCBioAssay
TargetZinc finger protein GLI1(Mus musculus)
Burnham Center For Chemical Genomics
Curated by PubChem BioAssay
LigandPNGBDBM54412(1-[1-(2-Fluoro-benzyl)-1H-indol-3-yl]-ethanone | 1...)
Affinity DataIC50:  8.82E+3nM. Assay description: Data Source: Sanford-Burnham Center for Chemical Genomics (SBCCG) Source Affiliation: Sanford-Burnham Medical Research Institute (SBMRI, San Diego, C...
In DepthDetails PCBioAssay
TargetTumor necrosis factor(Homo sapiens (Human))
Burnham Center For Chemical Genomics
Curated by PubChem BioAssay
LigandPNGBDBM54412(1-[1-(2-Fluoro-benzyl)-1H-indol-3-yl]-ethanone | 1...)
Affinity DataIC50:  5.01E+3nM. Assay description: Data Source: Sanford-Burnham Center for Chemical Genomics (SBCCG) Source Affiliation: Sanford-Burnham Medical Research Institute (SBMRI, San Diego, C...
In DepthDetails PCBioAssay