BDBM54498 2-[[2-(4-chlorophenyl)-5-methyl-1,3-oxazol-4-yl]methylsulfanyl]-N-[1-(phenylmethyl)piperidin-4-yl]ethanamide::2-[[2-(4-chlorophenyl)-5-methyl-4-oxazolyl]methylthio]-N-[1-(phenylmethyl)-4-piperidinyl]acetamide::MLS001030649::N-(1-benzyl-4-piperidyl)-2-[[2-(4-chlorophenyl)-5-methyl-oxazol-4-yl]methylthio]acetamide::N-(1-benzylpiperidin-4-yl)-2-[[2-(4-chlorophenyl)-5-methyl-1,3-oxazol-4-yl]methylsulfanyl]acetamide::SMR000635218::cid_20968904
SMILES Cc1oc(nc1CSCC(=O)NC1CCN(Cc2ccccc2)CC1)-c1ccc(Cl)cc1
InChI Key InChIKey=DMUBBYXIJZVCFD-UHFFFAOYSA-N
Data  3 IC50  1 EC50
  Tab Delimited (TSV)   2D SDfile   Computed 3D by Vconf -m prep SDfile
Find this compound or compounds like it in BindingDB:
Activity Spreadsheet -- Enzyme Inhibition Constant Data from BindingDB
Found 4 hits for monomerid = 54498
TargetNucleotide-binding oligomerization domain-containing protein 2(Homo sapiens (Human))
Burnham Center For Chemical Genomics
Curated by PubChem BioAssay
LigandPNGBDBM54498(2-[[2-(4-chlorophenyl)-5-methyl-1,3-oxazol-4-yl]me...)
Affinity DataIC50:  3.08E+3nM. Assay description: Data Source: Sanford-Burnham Center for Chemical Genomics (SBCCG) Source Affiliation: Sanford-Burnham Medical Research Institute (SBMRI, San Diego, C...
In DepthDetails PCBioAssay
TargetGalanin receptor type 3(Homo sapiens (Human))
The Scripps Research Institute Molecular Screening Center
Curated by PubChem BioAssay
LigandPNGBDBM54498(2-[[2-(4-chlorophenyl)-5-methyl-1,3-oxazol-4-yl]me...)
Affinity DataIC50:  1.29E+3nM
In DepthDetails PCBioAssay
TargetTumor necrosis factor(Homo sapiens (Human))
Burnham Center For Chemical Genomics
Curated by PubChem BioAssay
LigandPNGBDBM54498(2-[[2-(4-chlorophenyl)-5-methyl-1,3-oxazol-4-yl]me...)
Affinity DataIC50:  1.68E+3nM. Assay description: Data Source: Sanford-Burnham Center for Chemical Genomics (SBCCG) Source Affiliation: Sanford-Burnham Medical Research Institute (SBMRI, San Diego, C...
In DepthDetails PCBioAssay
TargetNucleotide-binding oligomerization domain-containing protein 1(Homo sapiens (Human))
Burnham Center For Chemical Genomics
Curated by PubChem BioAssay
LigandPNGBDBM54498(2-[[2-(4-chlorophenyl)-5-methyl-1,3-oxazol-4-yl]me...)
Affinity DataEC50:  2.62E+3nM. Assay description: Data Source: Sanford-Burnham Center for Chemical Genomics (SBCCG) Source Affiliation: Sanford-Burnham Medical Research Institute (SBMRI, San Diego, C...
In DepthDetails PCBioAssay