BDBM54646 4-[3-[4-(dimethylamino)phenyl]-5-(4-methoxyphenyl)-2-pyrazolin-1-yl]benzenesulfonamide::4-[5-[4-(dimethylamino)phenyl]-3-(4-methoxyphenyl)-3,4-dihydropyrazol-2-yl]benzenesulfonamide::KUC103422N::UNM-0000306141::cid_44143699
SMILES COc1ccc(cc1)C1CC(=NN1c1ccc(cc1)S(N)(=O)=O)c1ccc(cc1)N(C)C
InChI Key InChIKey=UOGQZVTZTMRSJQ-UHFFFAOYSA-N
Data  1 KI  8 EC50
  Tab Delimited (TSV)   2D SDfile   Computed 3D by Vconf -m prep SDfile
Find this compound or compounds like it in BindingDB:
Activity Spreadsheet -- Enzyme Inhibition Constant Data from BindingDB
Found 9 hits for monomerid = 54646
TargetCell division control protein 42 homolog(Homo sapiens (Human))
Nmmlsc
Curated by PubChem BioAssay
LigandPNGBDBM54646(4-[3-[4-(dimethylamino)phenyl]-5-(4-methoxyphenyl)...)
Affinity DataKi:  710nM. Assay description: University of New Mexico Assay Overview: Assay Support: NIH I RO3 MH081231-01 HTS to identify specific small molecule inhibitors of Ras and Ras-rela...
In DepthDetails PCBioAssay
TargetGTPase KRas [1-37](Homo sapiens (Human))
Nmmlsc
Curated by PubChem BioAssay
LigandPNGBDBM54646(4-[3-[4-(dimethylamino)phenyl]-5-(4-methoxyphenyl)...)
Affinity DataEC50:  3.00E+4nM. Assay description: University of New Mexico Assay Overview: Assay Support: NIH I RO3 MH081231-01 HTS to identify specific small molecule inhibitors of Ras and Ras-rela...
In DepthDetails PCBioAssay
LigandPNGBDBM54646(4-[3-[4-(dimethylamino)phenyl]-5-(4-methoxyphenyl)...)
Affinity DataEC50:  3.00E+4nM. Assay description: University of New Mexico Assay Overview: Assay Support: NIH I RO3 MH081231-01 HTS to identify specific small molecule inhibitors of Ras and Ras-rela...
In DepthDetails PCBioAssay
TargetGTPase KRas [1-37](Homo sapiens (Human))
Nmmlsc
Curated by PubChem BioAssay
LigandPNGBDBM54646(4-[3-[4-(dimethylamino)phenyl]-5-(4-methoxyphenyl)...)
Affinity DataEC50:  3.00E+4nM. Assay description: University of New Mexico Assay Overview: Assay Support: NIH I RO3 MH081231-01 HTS to identify specific small molecule inhibitors of Ras and Ras-rela...
In DepthDetails PCBioAssay
TargetRas-related protein Rab-7a(Canis lupus familiaris)
Nmmlsc
Curated by PubChem BioAssay
LigandPNGBDBM54646(4-[3-[4-(dimethylamino)phenyl]-5-(4-methoxyphenyl)...)
Affinity DataEC50:  3.00E+4nM. Assay description: University of New Mexico Assay Overview: Assay Support: NIH I RO3 MH081231-01 HTS to identify specific small molecule inhibitors of Ras and Ras-rela...
In DepthDetails PCBioAssay
TargetCell division control protein 42 homolog(Homo sapiens (Human))
Nmmlsc
Curated by PubChem BioAssay
LigandPNGBDBM54646(4-[3-[4-(dimethylamino)phenyl]-5-(4-methoxyphenyl)...)
Affinity DataEC50:  3.37E+3nM. Assay description: University of New Mexico Assay Overview: Assay Support: NIH I RO3 MH081231-01 HTS to identify specific small molecule inhibitors of Ras and Ras-rela...
In DepthDetails PCBioAssay
TargetCell division control protein 42 homolog(Homo sapiens (Human))
Nmmlsc
Curated by PubChem BioAssay
LigandPNGBDBM54646(4-[3-[4-(dimethylamino)phenyl]-5-(4-methoxyphenyl)...)
Affinity DataEC50:  3.00E+4nM. Assay description: University of New Mexico Assay Overview: Assay Support: NIH I RO3 MH081231-01 HTS to identify specific small molecule inhibitors of Ras and Ras-rela...
In DepthDetails PCBioAssay
TargetRas-related protein Rab-2A(Canis lupus familiaris)
Nmmlsc
Curated by PubChem BioAssay
LigandPNGBDBM54646(4-[3-[4-(dimethylamino)phenyl]-5-(4-methoxyphenyl)...)
Affinity DataEC50:  3.00E+4nM. Assay description: University of New Mexico Assay Overview: Assay Support: NIH I RO3 MH081231-01 HTS to identify specific small molecule inhibitors of Ras and Ras-rela...
In DepthDetails PCBioAssay
LigandPNGBDBM54646(4-[3-[4-(dimethylamino)phenyl]-5-(4-methoxyphenyl)...)
Affinity DataEC50:  3.00E+4nM. Assay description: University of New Mexico Assay Overview: Assay Support: NIH I RO3 MH081231-01 HTS to identify specific small molecule inhibitors of Ras and Ras-rela...
In DepthDetails PCBioAssay