BDBM54868 2-[(2-benzylsulfonyl-5-chloro-pyrimidine-4-carbonyl)amino]benzoic acid methyl ester::2-[[[5-chloro-2-(phenylmethyl)sulfonyl-4-pyrimidinyl]-oxomethyl]amino]benzoic acid methyl ester::BRD-K24620555-001-04-3::cid_16446376::methyl 2-[(2-benzylsulfonyl-5-chloropyrimidine-4-carbonyl)amino]benzoate::methyl 2-[[5-chloranyl-2-(phenylmethyl)sulfonyl-pyrimidin-4-yl]carbonylamino]benzoate
SMILES COC(=O)c1ccccc1NC(=O)c1nc(ncc1Cl)S(=O)(=O)Cc1ccccc1
InChI Key InChIKey=PROVYLNXVQCEOC-UHFFFAOYSA-N
Data  2 EC50
  Tab Delimited (TSV)   2D SDfile   Computed 3D by Vconf -m prep SDfile
Find this compound or compounds like it in BindingDB:
Activity Spreadsheet -- Enzyme Inhibition Constant Data from BindingDB
Found 2 hits for monomerid = 54868
TargetStreptokinase A(Streptococcus pyogenes M1 GAS)
Broad Institute
Curated by PubChem BioAssay
LigandPNGBDBM54868(2-[(2-benzylsulfonyl-5-chloro-pyrimidine-4-carbony...)
Affinity DataEC50:  3.08E+3nM. Assay description: Keywords: Group A streptococcus, GAS, streptokinase, expression, virulence, inhibition, dose response, EC50 Assay Overview: The goal of this assa...
In DepthDetails PCBioAssay
TargetStreptokinase A(Streptococcus pyogenes M1 GAS)
Broad Institute
Curated by PubChem BioAssay
LigandPNGBDBM54868(2-[(2-benzylsulfonyl-5-chloro-pyrimidine-4-carbony...)
Affinity DataEC50:  3.37E+3nM. Assay description: Keywords: Group A streptococcus, GAS, streptokinase, expression, virulence, inhibition, dose response, EC50 Assay Overview: The goal of this assa...
In DepthDetails PCBioAssay