BDBM54892 9-carbazolyl-[4-(trifluoromethoxy)phenyl]methanone::BRD-K83315615-001-01-2::carbazol-9-yl-[4-(trifluoromethoxy)phenyl]methanone::carbazol-9-yl-[4-(trifluoromethyloxy)phenyl]methanone::cid_44247468
SMILES FC(F)(F)Oc1ccc(cc1)C(=O)n1c2ccccc2c2ccccc12
InChI Key InChIKey=OUDOUCVMPYTWJQ-UHFFFAOYSA-N
Data  1 EC50
  Tab Delimited (TSV)   2D SDfile   Computed 3D by Vconf -m prep SDfile
Find this compound or compounds like it in BindingDB:
Activity Spreadsheet -- Enzyme Inhibition Constant Data from BindingDB
Found 1 hit for monomerid = 54892
TargetStreptokinase A(Streptococcus pyogenes M1 GAS)
Broad Institute
Curated by PubChem BioAssay
LigandPNGBDBM54892(9-carbazolyl-[4-(trifluoromethoxy)phenyl]methanone...)
Affinity DataEC50:  6.36E+3nM. Assay description: Keywords: Group A streptococcus, GAS, streptokinase, expression, virulence, inhibition, dose response, EC50 Assay Overview: The goal of this assa...
In DepthDetails PCBioAssay