BDBM54966 2-(3-butyl-4-oxidanylidene-quinazolin-2-yl)sulfanyl-N-(5-methyl-1,2-oxazol-3-yl)ethanamide::2-(3-butyl-4-oxoquinazolin-2-yl)sulfanyl-N-(5-methyl-1,2-oxazol-3-yl)acetamide::2-[(3-butyl-4-keto-quinazolin-2-yl)thio]-N-(5-methylisoxazol-3-yl)acetamide::2-[(3-butyl-4-oxo-2-quinazolinyl)thio]-N-(5-methyl-3-isoxazolyl)acetamide::MLS000098572::SMR000064948::cid_2609971
SMILES CCCCn1c(SCC(=O)Nc2cc(C)on2)nc2ccccc2c1=O
InChI Key InChIKey=GXKVQFZVXGSINN-UHFFFAOYSA-N
Data  1 IC50
  Tab Delimited (TSV)   2D SDfile   Computed 3D by Vconf -m prep SDfile
Find this compound or compounds like it in BindingDB:
Activity Spreadsheet -- Enzyme Inhibition Constant Data from BindingDB
Found 1 hit for monomerid = 54966
TargetCore protein(Hepatitis C virus)
The Scripps Research Institute Molecular Screening Center
Curated by PubChem BioAssay
LigandPNGBDBM54966(2-(3-butyl-4-oxidanylidene-quinazolin-2-yl)sulfany...)
Affinity DataIC50: >4.98E+4nM. Assay description: Source (MLPCN Center Name): The Scripps Research Institute Molecular Screening Center Affiliation: The Scripps Research Institute, TSRI Assay Provide...
In DepthDetails PCBioAssay