BDBM55119 (4Z)-2-(4-methoxyphenyl)-4-[(1,2,4-triazol-4-ylamino)methylene]isoquinoline-1,3-quinone::(4Z)-2-(4-methoxyphenyl)-4-[(1,2,4-triazol-4-ylamino)methylidene]isoquinoline-1,3-dione::MLS000108481::SMR000104438::cid_5310817
SMILES COc1ccc(cc1)-n1c(O)c(C=Nn2cnnc2)c2ccccc2c1=O
InChI Key InChIKey=IMISGFIUBHJEQT-UHFFFAOYSA-N
Data  2 IC50
  Tab Delimited (TSV)   2D SDfile   Computed 3D by Vconf -m prep SDfile
Find this compound or compounds like it in BindingDB:
Activity Spreadsheet -- Enzyme Inhibition Constant Data from BindingDB
Found 2 hits for monomerid = 55119
TargetProcathepsin L(Homo sapiens (Human))
The Scripps Research Institute Molecular Screening Center
Curated by PubChem BioAssay
LigandPNGBDBM55119((4Z)-2-(4-methoxyphenyl)-4-[(1,2,4-triazol-4-ylami...)
Affinity DataIC50: >5.96E+4nM. Assay description: Source (MLPCN Center Name): The Scripps Research Institute Molecular Screening Center Affiliation: The Scripps Research Institute, TSRI Assay Provide...
In DepthDetails PCBioAssay
TargetM18 aspartyl aminopeptidase(Plasmodium falciparum 3D7)
The Scripps Research Institute Molecular Screening Center
Curated by PubChem BioAssay
LigandPNGBDBM55119((4Z)-2-(4-methoxyphenyl)-4-[(1,2,4-triazol-4-ylami...)
Affinity DataIC50:  1.56E+3nM. Assay description: Source (MLPCN Center Name): The Scripps Research Institute Molecular Screening Center Affiliation: The Scripps Research Institute, TSRI Assay Provide...
In DepthDetails PCBioAssay