BDBM55137 2-(8-methoxy-2-methyl-quinolin-4-yl)sulfanyl-N'-[(Z)-(3-oxidanyl-4-oxidanylidene-cyclohexa-2,5-dien-1-ylidene)methyl]ethanehydrazide::MLS000703613::N'-[(Z)-(3-hydroxy-4-keto-cyclohexa-2,5-dien-1-ylidene)methyl]-2-[(8-methoxy-2-methyl-4-quinolyl)thio]acetohydrazide::N'-[(Z)-(3-hydroxy-4-oxo-1-cyclohexa-2,5-dienylidene)methyl]-2-[(8-methoxy-2-methyl-4-quinolinyl)thio]acetohydrazide::N'-[(Z)-(3-hydroxy-4-oxocyclohexa-2,5-dien-1-ylidene)methyl]-2-(8-methoxy-2-methylquinolin-4-yl)sulfanylacetohydrazide::SMR000273978::cid_5446018
SMILES COc1cccc2c(SCC(=O)NN=Cc3ccc(O)c(O)c3)cc(C)nc12
InChI Key InChIKey=LSDJWAQYWLHDKR-UHFFFAOYSA-N
Data  3 IC50
  Tab Delimited (TSV)   2D SDfile   Computed 3D by Vconf -m prep SDfile
Find this compound or compounds like it in BindingDB:
Activity Spreadsheet -- Enzyme Inhibition Constant Data from BindingDB
Found 3 hits for monomerid = 55137
TargetM18 aspartyl aminopeptidase(Plasmodium falciparum 3D7)
The Scripps Research Institute Molecular Screening Center
Curated by PubChem BioAssay
LigandPNGBDBM55137(2-(8-methoxy-2-methyl-quinolin-4-yl)sulfanyl-N'-[(...)
Affinity DataIC50:  2.01E+3nM. Assay description: Source (MLPCN Center Name): The Scripps Research Institute Molecular Screening Center Affiliation: The Scripps Research Institute, TSRI Assay Provide...
In DepthDetails PCBioAssay
TargetM17 leucyl aminopeptidase(Plasmodium falciparum 3D7)
Srmlsc
Curated by PubChem BioAssay
LigandPNGBDBM55137(2-(8-methoxy-2-methyl-quinolin-4-yl)sulfanyl-N'-[(...)
Affinity DataIC50:  1.62E+4nM. Assay description: Southern Research Molecular Libraries Screening Center (SRMLSC) Southern Research Institute (Birmingham, Alabama) NIH Molecular Libraries Screening...
In DepthDetails PCBioAssay
TargetProcathepsin L(Homo sapiens (Human))
The Scripps Research Institute Molecular Screening Center
Curated by PubChem BioAssay
LigandPNGBDBM55137(2-(8-methoxy-2-methyl-quinolin-4-yl)sulfanyl-N'-[(...)
Affinity DataIC50: >5.96E+4nM. Assay description: Source (MLPCN Center Name): The Scripps Research Institute Molecular Screening Center Affiliation: The Scripps Research Institute, TSRI Assay Provide...
In DepthDetails PCBioAssay