BDBM55178 1-(3-nitrophenyl)-3-(1,2,4-triazol-4-yl)urea::MLS001224685::SMR000678329::cid_17265868
SMILES [O-][N+](=O)c1cccc(NC(=O)Nn2cnnc2)c1
InChI Key InChIKey=MUUZMWGAFHSZLS-UHFFFAOYSA-N
Data  2 IC50
  Tab Delimited (TSV)   2D SDfile   Computed 3D by Vconf -m prep SDfile
Find this compound or compounds like it in BindingDB:
Activity Spreadsheet -- Enzyme Inhibition Constant Data from BindingDB
Found 2 hits for monomerid = 55178
TargetProcathepsin L(Homo sapiens (Human))
The Scripps Research Institute Molecular Screening Center
Curated by PubChem BioAssay
LigandPNGBDBM55178(1-(3-nitrophenyl)-3-(1,2,4-triazol-4-yl)urea | MLS...)
Affinity DataIC50: >5.96E+4nM. Assay description: Source (MLPCN Center Name): The Scripps Research Institute Molecular Screening Center Affiliation: The Scripps Research Institute, TSRI Assay Provide...
Ligand InfoPC cidPC sid
In DepthDetails PCBioAssay
TargetM18 aspartyl aminopeptidase(Plasmodium falciparum 3D7)
The Scripps Research Institute Molecular Screening Center
Curated by PubChem BioAssay
LigandPNGBDBM55178(1-(3-nitrophenyl)-3-(1,2,4-triazol-4-yl)urea | MLS...)
Affinity DataIC50:  930nM. Assay description: Source (MLPCN Center Name): The Scripps Research Institute Molecular Screening Center Affiliation: The Scripps Research Institute, TSRI Assay Provide...
Ligand InfoPC cidPC sid
In DepthDetails PCBioAssay