BDBM55415 MLS000519756::N-cyclohexyl-1-[2-furanylmethyl-(1-oxo-2-thiophen-2-ylethyl)amino]-1-cyclohexanecarboxamide::N-cyclohexyl-1-[2-furfuryl-[2-(2-thienyl)acetyl]amino]cyclohexanecarboxamide::N-cyclohexyl-1-[furan-2-ylmethyl(2-thiophen-2-ylethanoyl)amino]cyclohexane-1-carboxamide::N-cyclohexyl-1-[furan-2-ylmethyl-(2-thiophen-2-ylacetyl)amino]cyclohexane-1-carboxamide::SMR000130174::cid_4309872
SMILES O=C(Cc1cccs1)N(Cc1ccco1)C1(CCCCC1)C(=O)NC1CCCCC1
InChI Key InChIKey=OVVOYVATOVUZNI-UHFFFAOYSA-N
Data  1 IC50  1 EC50
  Tab Delimited (TSV)   2D SDfile   Computed 3D by Vconf -m prep SDfile
Find this compound or compounds like it in BindingDB:
Activity Spreadsheet -- Enzyme Inhibition Constant Data from BindingDB
Found 2 hits for monomerid = 55415
TargetHigh affinity choline transporter 1(Homo sapiens (Human))
Johns Hopkins Ion Channel Center
Curated by PubChem BioAssay
LigandPNGBDBM55415(MLS000519756 | N-cyclohexyl-1-[2-furanylmethyl-(1-...)
Affinity DataEC50:  2.42E+4nM. Assay description: Data Source (MLPCN Center Name): Johns Hopkins Ion Channel Center (JHICC) Center Affiliation: Johns Hopkins University, School of Medicine Screening ...
In DepthDetails PCBioAssay
TargetNeutrophil cytosol factor 1 [S99G](Homo sapiens (Human))
Emory University
Curated by PubChem BioAssay
LigandPNGBDBM55415(MLS000519756 | N-cyclohexyl-1-[2-furanylmethyl-(1-...)
Affinity DataIC50:  5.00E+4nM. Assay description: NIH Molecular Libraries Screening Centers Network [MLSCN] Emory Chemical Biology Discovery Center in MLSCN Assay provider: Susan Smith, Emory Univers...
In DepthDetails PCBioAssay