BDBM56833 (4-brosylphenyl)-(4-methylpiperazino)methanone::MLS000036244::SMR000041005::[4-(4-bromophenyl)sulfonylphenyl]-(4-methyl-1-piperazinyl)methanone::[4-(4-bromophenyl)sulfonylphenyl]-(4-methylpiperazin-1-yl)methanone::cid_660055
SMILES CN1CCN(CC1)C(=O)c1ccc(cc1)S(=O)(=O)c1ccc(Br)cc1
InChI Key InChIKey=QHJLQUYVLBPHDR-UHFFFAOYSA-N
Data  1 IC50
  Tab Delimited (TSV)   2D SDfile   Computed 3D by Vconf -m prep SDfile
Find this compound or compounds like it in BindingDB:
Activity Spreadsheet -- Enzyme Inhibition Constant Data from BindingDB
Found 1 hit for monomerid = 56833
TargetDNA repair protein RAD51 homolog 1(Homo sapiens (Human))
Pcmd
Curated by PubChem BioAssay
LigandPNGBDBM56833((4-brosylphenyl)-(4-methylpiperazino)methanone | M...)
Affinity DataIC50:  8.50E+4nM. Assay description: Project Title: A screen for modulators of human Rad51, a key DNA repair protein Application Number: MH084119 Assay Submitter: Dr. Alex Mazin Submitte...
In DepthDetails PCBioAssay