BDBM57181 (3Z)-2-(3-amylimidazol-3-ium-1-yl)-3-besylimino-4-keto-naphthalen-1-olate::(3Z)-3-(benzenesulfonylimino)-4-oxo-2-(3-pentyl-1-imidazol-3-iumyl)-1-naphthalenolate::(3Z)-3-(benzenesulfonylimino)-4-oxo-2-(3-pentylimidazol-3-ium-1-yl)naphthalen-1-olate::(3Z)-4-oxidanylidene-2-(3-pentylimidazol-3-ium-1-yl)-3-(phenylsulfonylimino)naphthalen-1-olate::MLS000555436::SMR000147153::cid_9551685
SMILES CCCCC[n+]1ccn(c1)C1=C([N-]S(=O)(=O)c2ccccc2)C(=O)c2ccccc2C1=O
InChI Key InChIKey=CVWXODFBKWPROK-UHFFFAOYSA-N
Data  3 IC50  1 EC50
  Tab Delimited (TSV)   2D SDfile   Computed 3D by Vconf -m prep SDfile
Find this compound or compounds like it in BindingDB:
Activity Spreadsheet -- Enzyme Inhibition Constant Data from BindingDB
Found 4 hits for monomerid = 57181
TargetStreptokinase A(Streptococcus pyogenes M1 GAS)
Broad Institute
Curated by PubChem BioAssay
LigandPNGBDBM57181((3Z)-2-(3-amylimidazol-3-ium-1-yl)-3-besylimino-4-...)
Affinity DataEC50:  3.69E+3nM. Assay description: Keywords: Group A streptococcus, GAS, streptokinase, expression, virulence, inhibition, dose response, EC50 Assay Overview: The goal of this assa...
In DepthDetails PCBioAssay
TargetCaspase-9(Homo sapiens (Human))
Burnham Center For Chemical Genomics
Curated by PubChem BioAssay
LigandPNGBDBM57181((3Z)-2-(3-amylimidazol-3-ium-1-yl)-3-besylimino-4-...)
Affinity DataIC50:  1.62E+4nM. Assay description: Data Source: Sanford-Burnham Center for Chemical Genomics (SBCCG) Source Affiliation: Sanford-Burnham Medical Research Institute (SBIMR, San Diego, C...
In DepthDetails PCBioAssay
TargetApoptotic protease-activating factor 1(Homo sapiens (Human))
Burnham Center For Chemical Genomics
Curated by PubChem BioAssay
LigandPNGBDBM57181((3Z)-2-(3-amylimidazol-3-ium-1-yl)-3-besylimino-4-...)
Affinity DataIC50: >1.00E+5nM. Assay description: Data Source: Sanford-Burnham Center for Chemical Genomics (SBCCG) Source Affiliation: Sanford-Burnham Medical Research Institute (SBIMR, San Diego, C...
In DepthDetails PCBioAssay
TargetApoptotic protease-activating factor 1(Homo sapiens (Human))
Burnham Center For Chemical Genomics
Curated by PubChem BioAssay
LigandPNGBDBM57181((3Z)-2-(3-amylimidazol-3-ium-1-yl)-3-besylimino-4-...)
Affinity DataIC50:  1.38E+4nM. Assay description: Data Source: Sanford-Burnham Center for Chemical Genomics (SBCCG) Source Affiliation: Sanford-Burnham Medical Research Institute (SBIMR, San Diego, C...
In DepthDetails PCBioAssay