BDBM57351 3-(2-furanylmethyl)-5,6-diphenyl-4-furo[2,3-d]pyrimidinimine::3-(furan-2-ylmethyl)-5,6-diphenyl-furo[2,3-d]pyrimidin-4-imine::3-(furan-2-ylmethyl)-5,6-diphenylfuro[2,3-d]pyrimidin-4-imine::3-Furan-2-ylmethyl-5,6-diphenyl-3H-furo[2,3-d]pyrimidin-4-ylideneamine::MLS000558643::SMR000176070::[3-(2-furfuryl)-5,6-diphenyl-furo[2,3-d]pyrimidin-4-ylidene]amine::cid_1106410
SMILES N=c1n(Cc2ccco2)cnc2oc(c(-c3ccccc3)c12)-c1ccccc1
InChI Key InChIKey=XTOYWMZBOPJBBF-UHFFFAOYSA-N
Data  2 EC50
  Tab Delimited (TSV)   2D SDfile   Computed 3D by Vconf -m prep SDfile
Find this compound or compounds like it in BindingDB:
Activity Spreadsheet -- Enzyme Inhibition Constant Data from BindingDB
Found 2 hits for monomerid = 57351
TargetSerine/threonine-protein kinase 33(Homo sapiens (Human))
Broad Institute
Curated by PubChem BioAssay
LigandPNGBDBM57351(3-(2-furanylmethyl)-5,6-diphenyl-4-furo[2,3-d]pyri...)
Affinity DataEC50: >1.20E+5nM. Assay description: Keywords: STK33 Kinase, Non-ATP Competitive Inhibitor Assay Overview: Purified STK33 Kinase is preincubated with potential inhibitors and allowed to ...
In DepthDetails PCBioAssay
TargetStreptokinase A(Streptococcus pyogenes M1 GAS)
Broad Institute
Curated by PubChem BioAssay
LigandPNGBDBM57351(3-(2-furanylmethyl)-5,6-diphenyl-4-furo[2,3-d]pyri...)
Affinity DataEC50:  1.75E+4nM. Assay description: Keywords: Group A streptococcus, GAS, streptokinase, expression, virulence, inhibition, dose response, EC50 Assay Overview: The goal of this assa...
In DepthDetails PCBioAssay