BDBM57828 1-(3,5-dichlorophenyl)-3-(3-pyridinyl)urea::1-(3,5-dichlorophenyl)-3-(3-pyridyl)urea::1-(3,5-dichlorophenyl)-3-pyridin-3-ylurea::1-[3,5-bis(chloranyl)phenyl]-3-pyridin-3-yl-urea::MLS000679320::N-(3,5-dichlorophenyl)-N'-3-pyridinylurea::SMR000297726::cid_6468481
SMILES Clc1cc(Cl)cc(NC(=O)Nc2cccnc2)c1
InChI Key InChIKey=YCNUSBREZUWZEV-UHFFFAOYSA-N
Data  3 EC50
  Tab Delimited (TSV)   2D SDfile   Computed 3D by Vconf -m prep SDfile
Find this compound or compounds like it in BindingDB:
Activity Spreadsheet -- Enzyme Inhibition Constant Data from BindingDB
Found 3 hits for monomerid = 57828
TargetStreptokinase A(Streptococcus pyogenes M1 GAS)
Broad Institute
Curated by PubChem BioAssay
LigandPNGBDBM57828(1-(3,5-dichlorophenyl)-3-(3-pyridinyl)urea | 1-(3,...)
Affinity DataEC50:  1.50E+5nM. Assay description: Keywords: Group A streptococcus, GAS, streptokinase, expression, virulence, inhibition, dose response, EC50 Assay Overview: The goal of this assa...
In DepthDetails PCBioAssay
TargetAryl hydrocarbon receptor(Homo sapiens (Human))
The Scripps Research Institute Molecular Screening Center
Curated by PubChem BioAssay
LigandPNGBDBM57828(1-(3,5-dichlorophenyl)-3-(3-pyridinyl)urea | 1-(3,...)
Affinity DataEC50: >1.13E+3nM. Assay description: Source (MLPCN Center Name): The Scripps Research Institute Molecular Screening Center (SRIMSC) Center Affiliation: The Scripps Research Institute (TS...
In DepthDetails PCBioAssay
TargetNuclear receptor subfamily 1 group I member 2(Homo sapiens (Human))
The Scripps Research Institute Molecular Screening Center
Curated by PubChem BioAssay
LigandPNGBDBM57828(1-(3,5-dichlorophenyl)-3-(3-pyridinyl)urea | 1-(3,...)
Affinity DataEC50: >1.16E+5nM. Assay description: Source (MLPCN Center Name): The Scripps Research Institute Molecular Screening Center (SRIMSC) Center Affiliation: The Scripps Research Institute (TS...
In DepthDetails PCBioAssay