BDBM59285 1-(3-carbazol-9-ylpropanoylamino)-3-ethyl-thiourea::1-(3-carbazol-9-ylpropanoylamino)-3-ethylthiourea::1-[[3-(9-carbazolyl)-1-oxopropyl]amino]-3-ethylthiourea::MLS000562304::SMR000175520::cid_2257517
SMILES CCNC(=S)NNC(=O)CCn1c2ccccc2c2ccccc12
InChI Key InChIKey=VKPBBMIKOBRYCY-UHFFFAOYSA-N
Data  1 EC50
  Tab Delimited (TSV)   2D SDfile   Computed 3D by Vconf -m prep SDfile
Find this compound or compounds like it in BindingDB:
Activity Spreadsheet -- Enzyme Inhibition Constant Data from BindingDB
Found 1 hit for monomerid = 59285
TargetAlkaline phosphatase, tissue-nonspecific isozyme(Homo sapiens (Human))
Sanford-Burnham Center For Chemical Genomics
Curated by PubChem BioAssay
LigandPNGBDBM59285(1-(3-carbazol-9-ylpropanoylamino)-3-ethyl-thiourea...)
Affinity DataEC50:  1.00E+5nM. Assay description: Data Source: Sanford-Burnham Center for Chemical Genomics (SBCCG) Source Affiliation: Sanford-Burnham Medical Research Institute (SBMRI, San Diego, C...
In DepthDetails PCBioAssay