BDBM59303 1-N',6-N'-bis(5-methyl-1H-pyrazole-3-carbonyl)hexanedihydrazide::MLS000721980::N1',N6'-bis(5-methyl-1H-pyrazole-3-carbonyl)adipohydrazide::N1',N6'-bis[(5-methyl-1H-pyrazol-3-yl)-oxomethyl]hexanedihydrazide::N1',N6'-bis[(5-methyl-1H-pyrazol-3-yl)carbonyl]hexanedihydrazide::SMR000236684::cid_3689609
SMILES Cc1cc([nH]n1)C(=O)NNC(=O)CCCCC(=O)NNC(=O)c1cc(C)n[nH]1
InChI Key InChIKey=PNPKTABRPYDDGB-UHFFFAOYSA-N
Data  1 EC50
  Tab Delimited (TSV)   2D SDfile   Computed 3D by Vconf -m prep SDfile
Find this compound or compounds like it in BindingDB:
Activity Spreadsheet -- Enzyme Inhibition Constant Data from BindingDB
Found 1 hit for monomerid = 59303
TargetAlkaline phosphatase, tissue-nonspecific isozyme(Homo sapiens (Human))
Sanford-Burnham Center For Chemical Genomics
Curated by PubChem BioAssay
LigandPNGBDBM59303(1-N',6-N'-bis(5-methyl-1H-pyrazole-3-carbonyl)hexa...)
Affinity DataEC50:  1.55E+4nM. Assay description: Data Source: Sanford-Burnham Center for Chemical Genomics (SBCCG) Source Affiliation: Sanford-Burnham Medical Research Institute (SBMRI, San Diego, C...
In DepthDetails PCBioAssay