BDBM59320 3-[6-[2-(butylamino)-2-oxidanylidene-ethyl]sulfanyl-8-oxidanylidene-[1,3]dioxolo[4,5-g]quinazolin-7-yl]-N-[2-(3,4-dimethoxyphenyl)ethyl]propanamide::3-[6-[2-(butylamino)-2-oxoethyl]sulfanyl-8-oxo-[1,3]dioxolo[4,5-g]quinazolin-7-yl]-N-[2-(3,4-dimethoxyphenyl)ethyl]propanamide::3-[6-[[2-(butylamino)-2-keto-ethyl]thio]-8-keto-[1,3]dioxolo[4,5-g]quinazolin-7-yl]-N-homoveratryl-propionamide::3-[6-[[2-(butylamino)-2-oxoethyl]thio]-8-oxo-[1,3]dioxolo[4,5-g]quinazolin-7-yl]-N-[2-(3,4-dimethoxyphenyl)ethyl]propanamide::3-[6-{[2-(butylamino)-2-oxoethyl]thio}-8-oxo[1,3]dioxolo[4,5-g]quinazolin-7(8H)-yl]-N-[2-(3,4-dimethoxyphenyl)ethyl]propanamide::MLS000621833::SMR000310760::cid_16193472
SMILES CCCCNC(=O)CSc1nc2cc3OCOc3cc2c(=O)n1CCC(=O)NCCc1ccc(OC)c(OC)c1
InChI Key InChIKey=QIVRZZGEAKERIW-UHFFFAOYSA-N
Data  1 EC50
  Tab Delimited (TSV)   2D SDfile   Computed 3D by Vconf -m prep SDfile
Find this compound or compounds like it in BindingDB:
Activity Spreadsheet -- Enzyme Inhibition Constant Data from BindingDB
Found 1 hit for monomerid = 59320
TargetAlkaline phosphatase, tissue-nonspecific isozyme(Homo sapiens (Human))
Sanford-Burnham Center For Chemical Genomics
Curated by PubChem BioAssay
LigandPNGBDBM59320(3-[6-[2-(butylamino)-2-oxidanylidene-ethyl]sulfany...)
Affinity DataEC50:  1.00E+5nM. Assay description: Data Source: Sanford-Burnham Center for Chemical Genomics (SBCCG) Source Affiliation: Sanford-Burnham Medical Research Institute (SBMRI, San Diego, C...
In DepthDetails PCBioAssay