BDBM59361 2-[(6-bromanyl-1H-imidazo[4,5-b]pyridin-2-yl)sulfanylmethyl]benzenecarbonitrile::2-[(6-bromo-1H-imidazo[4,5-b]pyridin-2-yl)sulfanylmethyl]benzonitrile::2-[[(6-bromo-1H-imidazo[4,5-b]pyridin-2-yl)thio]methyl]benzonitrile::2-[[(6-bromo-1H-imidazo[4,5-b]pyridin-2-yl)thio]methyl]benzonitrile;2,2,2-trifluoroacetic acid::2-{[(6-bromo-3H-imidazo[4,5-b]pyridin-2-yl)thio]methyl}benzonitrile::MLS000089867::SMR000024485::cid_3245059
SMILES Brc1cnc2nc(SCc3ccccc3C#N)[nH]c2c1
InChI Key InChIKey=DEYMHFHACXKPOV-UHFFFAOYSA-N
Data  2 IC50
  Tab Delimited (TSV)   2D SDfile   Computed 3D by Vconf -m prep SDfile
Find this compound or compounds like it in BindingDB:
Activity Spreadsheet -- Enzyme Inhibition Constant Data from BindingDB
Found 2 hits for monomerid = 59361
TargetMethionine--tRNA ligase(Trypanosoma brucei brucei strain 927/4 GUTat10.1)
The Scripps Research Institute Molecular Screening Center
Curated by PubChem BioAssay
LigandPNGBDBM59361(2-[(6-bromanyl-1H-imidazo[4,5-b]pyridin-2-yl)sulfa...)
Affinity DataIC50: >1.19E+5nM
In DepthDetails PCBioAssay
TargetE3 ubiquitin-protein ligase XIAP(Homo sapiens (Human))
Sanford-Burnham Center For Chemical Genomics
Curated by PubChem BioAssay
LigandPNGBDBM59361(2-[(6-bromanyl-1H-imidazo[4,5-b]pyridin-2-yl)sulfa...)
Affinity DataIC50:  1.00E+5nM. Assay description: Data Source: Sanford-Burnham Center for Chemical Genomics (SBCCG) Source Affiliation: Sanford-Burnham Medical Research Institute (SBMRI, San Diego, C...
In DepthDetails PCBioAssay