BDBM59374 2-(2-furanylmethylamino)-4-pyrido[3,2-e][1,3]thiazinone::2-(2-furfurylamino)pyrido[3,2-e][1,3]thiazin-4-one::2-(furan-2-ylmethylamino)pyrido[3,2-e][1,3]thiazin-4-one::2-[(2-furylmethyl)amino]-4H-pyrido[3,2-e][1,3]thiazin-4-one::MLS000064993::SMR000078327::cid_2217458
SMILES O=c1nc(NCc2ccco2)sc2ncccc12
InChI Key InChIKey=DCMDRUNBTOYUFA-UHFFFAOYSA-N
Data  1 IC50
  Tab Delimited (TSV)   2D SDfile   Computed 3D by Vconf -m prep SDfile
Find this compound or compounds like it in BindingDB:
Activity Spreadsheet -- Enzyme Inhibition Constant Data from BindingDB
Found 1 hit for monomerid = 59374
TargetE3 ubiquitin-protein ligase XIAP(Homo sapiens (Human))
Sanford-Burnham Center For Chemical Genomics
Curated by PubChem BioAssay
LigandPNGBDBM59374(2-(2-furanylmethylamino)-4-pyrido[3,2-e][1,3]thiaz...)
Affinity DataIC50:  1.00E+5nM. Assay description: Data Source: Sanford-Burnham Center for Chemical Genomics (SBCCG) Source Affiliation: Sanford-Burnham Medical Research Institute (SBMRI, San Diego, C...
In DepthDetails PCBioAssay