BDBM59474 MLS000699330::N'-(2,5-dimethoxybenzylidene)-5-({4-nitro-1H-pyrazol-1-yl}methyl)-2-furohydrazide::N-[(2,5-dimethoxybenzylidene)amino]-5-[(4-nitropyrazol-1-yl)methyl]-2-furamide::N-[(2,5-dimethoxyphenyl)methylideneamino]-5-[(4-nitro-1-pyrazolyl)methyl]-2-furancarboxamide::N-[(2,5-dimethoxyphenyl)methylideneamino]-5-[(4-nitropyrazol-1-yl)methyl]furan-2-carboxamide::SMR000227733::cid_1014538
SMILES COc1ccc(OC)c(C=NNC(=O)c2ccc(Cn3cc(cn3)[N+]([O-])=O)o2)c1
InChI Key InChIKey=DCFXOUUTEMVCFV-UHFFFAOYSA-N
Data  1 IC50
  Tab Delimited (TSV)   2D SDfile   Computed 3D by Vconf -m prep SDfile
Find this compound or compounds like it in BindingDB:
Activity Spreadsheet -- Enzyme Inhibition Constant Data from BindingDB
Found 1 hit for monomerid = 59474
TargetE3 ubiquitin-protein ligase XIAP(Homo sapiens (Human))
Sanford-Burnham Center For Chemical Genomics
Curated by PubChem BioAssay
LigandPNGBDBM59474(MLS000699330 | N'-(2,5-dimethoxybenzylidene)-5...)
Affinity DataIC50:  1.00E+5nM. Assay description: Data Source: Sanford-Burnham Center for Chemical Genomics (SBCCG) Source Affiliation: Sanford-Burnham Medical Research Institute (SBMRI, San Diego, C...
In DepthDetails PCBioAssay