BDBM60013 2-[(3-carbethoxy-4-ethyl-5-methyl-2-thienyl)carbamoyl]bicyclo[2.2.2]oct-5-ene-3-carboxylic acid::2-[(3-ethoxycarbonyl-4-ethyl-5-methyl-thiophen-2-yl)carbamoyl]bicyclo[2.2.2]oct-5-ene-3-carboxylic acid::2-[(3-ethoxycarbonyl-4-ethyl-5-methylthiophen-2-yl)carbamoyl]bicyclo[2.2.2]oct-5-ene-3-carboxylic acid::2-[[(3-ethoxycarbonyl-4-ethyl-5-methyl-2-thiophenyl)amino]-oxomethyl]-3-bicyclo[2.2.2]oct-5-enecarboxylic acid::3-({[3-(ethoxycarbonyl)-4-ethyl-5-methyl-2-thienyl]amino}carbonyl)bicyclo[2.2.2]oct-5-ene-2-carboxylic acid::MLS000705422::SMR000231349::cid_4595804
SMILES [H]C12CCC([H])(C=C1)C(C2C(O)=O)C(=O)Nc1sc(C)c(CC)c1C(=O)OCC
InChI Key InChIKey=WNONPYXRQSNKDT-UHFFFAOYSA-N
Data  1 IC50
  Tab Delimited (TSV)   2D SDfile   Computed 3D by Vconf -m prep SDfile
Find this compound or compounds like it in BindingDB:
Activity Spreadsheet -- Enzyme Inhibition Constant Data from BindingDB
Found 1 hit for monomerid = 60013
TargetM17 leucyl aminopeptidase(Plasmodium falciparum 3D7)
Srmlsc
Curated by PubChem BioAssay
LigandPNGBDBM60013(2-[(3-carbethoxy-4-ethyl-5-methyl-2-thienyl)carbam...)
Affinity DataIC50:  1.32E+4nM. Assay description: Southern Research Molecular Libraries Screening Center (SRMLSC) Southern Research Institute (Birmingham, Alabama) NIH Molecular Libraries Screening...
In DepthDetails PCBioAssay