BDBM60241 2-(4-chlorophenyl)-N'-(2-pyridinylmethylene)-4-quinolinecarbohydrazide::2-(4-chlorophenyl)-N-(2-pyridinylmethylideneamino)-4-quinolinecarboxamide::2-(4-chlorophenyl)-N-(2-pyridylmethyleneamino)cinchoninamide::2-(4-chlorophenyl)-N-(pyridin-2-ylmethylideneamino)quinoline-4-carboxamide::MLS000699226::SMR000227454::cid_1012448
SMILES Clc1ccc(cc1)-c1cc(C(=O)NN=Cc2ccccn2)c2ccccc2n1
InChI Key InChIKey=VSKQBNLMLOXVED-UHFFFAOYSA-N
Data  3 IC50
  Tab Delimited (TSV)   2D SDfile   Computed 3D by Vconf -m prep SDfile
Find this compound or compounds like it in BindingDB:
Activity Spreadsheet -- Enzyme Inhibition Constant Data from BindingDB
Found 3 hits for monomerid = 60241
TargetKappa-type opioid receptor(Homo sapiens (Human))
Burnham Center For Chemical Genomics
Curated by PubChem BioAssay
LigandPNGBDBM60241(2-(4-chlorophenyl)-N'-(2-pyridinylmethylene)-4...)
Affinity DataIC50:  1.58E+3nM. Assay description: Data Source: Sanford-Burnham Center for Chemical Genomics (SBCCG) Source Affiliation: Sanford-Burnham Medical Research Institute (SBMRI, San Diego, C...
In DepthDetails PCBioAssay
TargetType-1 angiotensin II receptor(Homo sapiens (Human))
Burnham Center For Chemical Genomics
Curated by PubChem BioAssay
LigandPNGBDBM60241(2-(4-chlorophenyl)-N'-(2-pyridinylmethylene)-4...)
Affinity DataIC50:  4.90E+3nM. Assay description: Data Source: Sanford-Burnham Center for Chemical Genomics (SBCCG) Source Affiliation: Sanford-Burnham Medical Research Institute(SBMRI, San Diego, C...
In DepthDetails PCBioAssay
TargetApelin receptor(Homo sapiens (Human))
Sanford-Burnham Center For Chemical Genomics
Curated by PubChem BioAssay
LigandPNGBDBM60241(2-(4-chlorophenyl)-N'-(2-pyridinylmethylene)-4...)
Affinity DataIC50:  4.11E+3nM. Assay description: Data Source: Sanford-Burnham Center for Chemical Genomics (SBCCG) Source Affiliation: Sanford- Sanford-Burnham Medical Research Institute(SBMRI, San...
In DepthDetails PCBioAssay