BDBM60348 2-[[6-chloro-2-(4-hydroxyphenyl)-3-imidazo[1,2-a]pyridinyl]amino]acetic acid ethyl ester;hydrochloride::2-[[6-chloro-2-(4-hydroxyphenyl)imidazo[1,2-a]pyridin-3-yl]amino]acetic acid ethyl ester;hydrochloride::MLS000032331::SMR000002670::[6-Chloro-2-(4-hydroxy-phenyl)-imidazo[1,2-a]pyridin-3-ylamino]-acetic acid ethyl ester::cid_6602559::ethyl 2-[[6-chloranyl-2-(4-hydroxyphenyl)imidazo[1,2-a]pyridin-3-yl]amino]ethanoate;hydrochloride::ethyl 2-[[6-chloro-2-(4-hydroxyphenyl)imidazo[1,2-a]pyridin-3-yl]amino]acetate;hydrochloride
SMILES CCOC(=O)CNc1c(nc2ccc(Cl)cn12)-c1ccc(O)cc1
InChI Key InChIKey=DMPCICOMNKWYCM-UHFFFAOYSA-N
Data  1 IC50
  Tab Delimited (TSV)   2D SDfile   Computed 3D by Vconf -m prep SDfile
Find this compound or compounds like it in BindingDB:
Activity Spreadsheet -- Enzyme Inhibition Constant Data from BindingDB
Found 1 hit for monomerid = 60348
TargetLarge T antigen(Simian virus 40)
Southern Research Specialized Biocontainment Screening Center
Curated by PubChem BioAssay
LigandPNGBDBM60348(2-[[6-chloro-2-(4-hydroxyphenyl)-3-imidazo[1,2-a]p...)
Affinity DataIC50:  1.59E+4nM. Assay description: A biochemical assay using the ADP-Hunter methodology, purified TAg, and ATP to identify compounds that inhibit the ATPase activity of Tag Southern Re...
In DepthDetails PCBioAssay