BDBM60404 3-[2,5-bis(oxidanylidene)pyrrolidin-1-yl]-N-[4-(dimethylamino)phenyl]benzamide::MLS000107693::N-[4-(dimethylamino)phenyl]-3-(2,5-dioxo-1-pyrrolidinyl)benzamide::N-[4-(dimethylamino)phenyl]-3-(2,5-dioxopyrrolidin-1-yl)benzamide::N-[4-(dimethylamino)phenyl]-3-succinimido-benzamide::SMR000103658::cid_867569
SMILES CN(C)c1ccc(NC(=O)c2cccc(c2)-n2c(O)ccc2O)cc1
InChI Key InChIKey=FYXMPQYBSXFOQF-UHFFFAOYSA-N
Data  1 IC50
  Tab Delimited (TSV)   2D SDfile   Computed 3D by Vconf -m prep SDfile
Find this compound or compounds like it in BindingDB:
Activity Spreadsheet -- Enzyme Inhibition Constant Data from BindingDB
Found 1 hit for monomerid = 60404
TargetLarge T antigen(Simian virus 40)
Southern Research Specialized Biocontainment Screening Center
Curated by PubChem BioAssay
LigandPNGBDBM60404(3-[2,5-bis(oxidanylidene)pyrrolidin-1-yl]-N-[4-(di...)
Affinity DataIC50:  9.21E+3nM. Assay description: A biochemical assay using the ADP-Hunter methodology, purified TAg, and ATP to identify compounds that inhibit the ATPase activity of Tag Southern Re...
In DepthDetails PCBioAssay