BDBM61014 MLS000538457::N-[5-(methoxymethyl)-1,3,4-thiadiazol-2-yl]-3-(phenylthio)propanamide::N-[5-(methoxymethyl)-1,3,4-thiadiazol-2-yl]-3-(phenylthio)propionamide::N-[5-(methoxymethyl)-1,3,4-thiadiazol-2-yl]-3-phenylsulfanyl-propanamide::N-[5-(methoxymethyl)-1,3,4-thiadiazol-2-yl]-3-phenylsulfanylpropanamide::SMR000144494::cid_1251582
SMILES COCc1nnc(NC(=O)CCSc2ccccc2)s1
InChI Key InChIKey=WHEVHSWGYOGREI-UHFFFAOYSA-N
Data  1 EC50
  Tab Delimited (TSV)   2D SDfile   Computed 3D by Vconf -m prep SDfile
Find this compound or compounds like it in BindingDB:
Activity Spreadsheet -- Enzyme Inhibition Constant Data from BindingDB
Found 1 hit for monomerid = 61014
TargetG-protein coupled receptor 55(Homo sapiens (Human))
Burnham Center For Chemical Genomics
Curated by PubChem BioAssay
LigandPNGBDBM61014(MLS000538457 | N-[5-(methoxymethyl)-1,3,4-thiadiaz...)
Affinity DataEC50:  3.20E+4nM. Assay description: Data Source: Sanford-Burnham Center for Chemical Genomics (SBCCG) Source Affiliation: Sanford-Burnham Medical Research Institute (SBMRI, San Diego, C...
In DepthDetails PCBioAssay