BDBM61341 1-(2-Hydroxy-ethyl)-2-(3-methyl-3H-benzothiazol-2-ylidenemethyl)-pyridinium::2-[2-[(Z)-(3-methyl-1,3-benzothiazol-2-ylidene)methyl]-1-pyridin-1-iumyl]ethanol;iodide::2-[2-[(Z)-(3-methyl-1,3-benzothiazol-2-ylidene)methyl]pyridin-1-ium-1-yl]ethanol;iodide::MLS001213058::SMR000518480::cid_24747118
SMILES CN1\C(Sc2ccccc12)=C\c1cccc[n+]1CCO
InChI Key InChIKey=LJXKUMLQMMBFLH-UHFFFAOYSA-N
Data  2 IC50
  Tab Delimited (TSV)   2D SDfile   Computed 3D by Vconf -m prep SDfile
Find this compound or compounds like it in BindingDB:
Activity Spreadsheet -- Enzyme Inhibition Constant Data from BindingDB
Found 2 hits for monomerid = 61341
TargetEukaryotic translation initiation factor 4H(Homo sapiens (Human))
Burnham Center For Chemical Genomics
Curated by PubChem BioAssay
LigandPNGBDBM61341(1-(2-Hydroxy-ethyl)-2-(3-methyl-3H-benzothiazol-2-...)
Affinity DataIC50:  1.00E+5nM. Assay description: Data Source: Sanford-Burnham Center for Chemical Genomics (SBCCG) Source Affiliation: Sanford-Burnham Medical Research Institute (SBMRI, San Diego, C...
In DepthDetails PCBioAssay
TargetPolyadenylate-binding protein 1(Homo sapiens (Human))
Burnham Center For Chemical Genomics
Curated by PubChem BioAssay
LigandPNGBDBM61341(1-(2-Hydroxy-ethyl)-2-(3-methyl-3H-benzothiazol-2-...)
Affinity DataIC50:  1.87E+3nM. Assay description: Data Source: Sanford-Burnham Center for Chemical Genomics (SBCCG) Source Affiliation: Sanford-Burnham Medical Research Institute (SBMRI, San Diego, C...
In DepthDetails PCBioAssay