BDBM61366 (4S,5R,6R)-1-ethyl-2-(2-methoxyethylamino)-6-methyl-4-(2-phenylethyl)-5,6-dihydro-4H-pyrimidine-5-carboxylic acid methyl ester::(4S,5R,6R)-1-ethyl-2-(2-methoxyethylamino)-6-methyl-4-phenethyl-5,6-dihydro-4H-pyrimidine-5-carboxylic acid methyl ester::MLS000829915::SMR000672027::cid_24789243::methyl (4S,5R,6R)-1-ethyl-2-(2-methoxyethylamino)-6-methyl-4-(2-phenylethyl)-5,6-dihydro-4H-pyrimidine-5-carboxylate
SMILES CCN1[C@H](C)[C@H]([C@H](CCc2ccccc2)N=C1NCCOC)C(=O)OC
InChI Key InChIKey=QADQIRYLHBOIOH-BPQIPLTHSA-N
Data  4 IC50
  Tab Delimited (TSV)   2D SDfile   Computed 3D by Vconf -m prep SDfile
Find this compound or compounds like it in BindingDB:
Activity Spreadsheet -- Enzyme Inhibition Constant Data from BindingDB
Found 4 hits for monomerid = 61366
TargetPolyadenylate-binding protein 1(Homo sapiens (Human))
Burnham Center For Chemical Genomics
Curated by PubChem BioAssay
LigandPNGBDBM61366((4S,5R,6R)-1-ethyl-2-(2-methoxyethylamino)-6-methy...)
Affinity DataIC50:  8.17E+3nM. Assay description: Data Source: Sanford-Burnham Center for Chemical Genomics (SBCCG) Source Affiliation: Sanford-Burnham Medical Research Institute (SBMRI, San Diego, C...
Ligand InfoPC cidPC sid
In DepthDetails PCBioAssay
TargetDNA dC->dU-editing enzyme APOBEC-3G(Homo sapiens (Human))
Burnham Center For Chemical Genomics
Curated by PubChem BioAssay
LigandPNGBDBM61366((4S,5R,6R)-1-ethyl-2-(2-methoxyethylamino)-6-methy...)
Affinity DataIC50:  4.15E+3nMT: 2°C. Assay description: Data Source: Sanford-Burnham Center for Chemical Genomics (SBCCG) Source Affiliation: Sanford-Burnham Medical Research Institute (SBMRI, San Diego, C...
Ligand InfoPC cidPC sid
In DepthDetails PCBioAssay
TargetDNA dC->dU-editing enzyme APOBEC-3A(Homo sapiens (Human))
Burnham Center For Chemical Genomics
Curated by PubChem BioAssay
LigandPNGBDBM61366((4S,5R,6R)-1-ethyl-2-(2-methoxyethylamino)-6-methy...)
Affinity DataIC50:  3.39E+3nMT: 2°C. Assay description: Data Source: Sanford-Burnham Center for Chemical Genomics (SBCCG) Source Affiliation: Sanford-Burnham Medical Research Institute (SBMRI, San Diego, C...
Ligand InfoPC cidPC sid
In DepthDetails PCBioAssay
TargetEukaryotic translation initiation factor 4H(Homo sapiens (Human))
Burnham Center For Chemical Genomics
Curated by PubChem BioAssay
LigandPNGBDBM61366((4S,5R,6R)-1-ethyl-2-(2-methoxyethylamino)-6-methy...)
Affinity DataIC50:  1.00E+5nM. Assay description: Data Source: Sanford-Burnham Center for Chemical Genomics (SBCCG) Source Affiliation: Sanford-Burnham Medical Research Institute (SBMRI, San Diego, C...
Ligand InfoPC cidPC sid
In DepthDetails PCBioAssay