BDBM61392 1-(3-chloro-4-methoxy-anilino)ethylidene-[2-[(4-chlorophenyl)sulfonylamino]ethyl]-methyl-ammonium;iodide::1-(3-chloro-4-methoxyanilino)ethylidene-[2-[(4-chlorophenyl)sulfonylamino]ethyl]-methylammonium;iodide::1-(3-chloro-4-methoxyanilino)ethylidene-[2-[(4-chlorophenyl)sulfonylamino]ethyl]-methylazanium;iodide::1-[(3-chloranyl-4-methoxy-phenyl)amino]ethylidene-[2-[(4-chlorophenyl)sulfonylamino]ethyl]-methyl-azanium;iodide::3-chloro-N-{(Z)-1-[(2-{[(4-chlorophenyl)sulfonyl]amino}ethyl)(methyl)amino]ethylidene}-4-methoxybenzenaminium iodide::MLS001165876::SMR000672482::cid_16413721
SMILES COc1ccc(N\C(C)=[N+](/C)CCNS(=O)(=O)c2ccc(Cl)cc2)cc1Cl
InChI Key InChIKey=GTHJXDVCRVKKSE-UHFFFAOYSA-O
Data  2 IC50
  Tab Delimited (TSV)   2D SDfile   Computed 3D by Vconf -m prep SDfile
Find this compound or compounds like it in BindingDB:
Activity Spreadsheet -- Enzyme Inhibition Constant Data from BindingDB
Found 2 hits for monomerid = 61392
TargetEukaryotic translation initiation factor 4H(Homo sapiens (Human))
Burnham Center For Chemical Genomics
Curated by PubChem BioAssay
LigandPNGBDBM61392(1-(3-chloro-4-methoxy-anilino)ethylidene-[2-[(4-ch...)
Affinity DataIC50:  1.00E+5nM. Assay description: Data Source: Sanford-Burnham Center for Chemical Genomics (SBCCG) Source Affiliation: Sanford-Burnham Medical Research Institute (SBMRI, San Diego, C...
In DepthDetails PCBioAssay
TargetPolyadenylate-binding protein 1(Homo sapiens (Human))
Burnham Center For Chemical Genomics
Curated by PubChem BioAssay
LigandPNGBDBM61392(1-(3-chloro-4-methoxy-anilino)ethylidene-[2-[(4-ch...)
Affinity DataIC50:  5.83E+3nM. Assay description: Data Source: Sanford-Burnham Center for Chemical Genomics (SBCCG) Source Affiliation: Sanford-Burnham Medical Research Institute (SBMRI, San Diego, C...
In DepthDetails PCBioAssay