BDBM61649 4-[4-[(5E)-2,4-bis(oxidanylidene)-5-[(E)-3-phenylprop-2-enylidene]-1,3-thiazolidin-3-yl]butanoylamino]benzoic acid::4-[4-[(5E)-2,4-diketo-5-[(E)-3-phenylprop-2-enylidene]thiazolidin-3-yl]butanoylamino]benzoic acid::4-[4-[(5E)-2,4-dioxo-5-[(E)-3-phenylprop-2-enylidene]-1,3-thiazolidin-3-yl]butanoylamino]benzoic acid::4-[[4-[(5E)-2,4-dioxo-5-[(E)-3-phenylprop-2-enylidene]-3-thiazolidinyl]-1-oxobutyl]amino]benzoic acid::MLS001031473::SMR000659649::cid_1348328
SMILES OC(=O)c1ccc(NC(=O)CCCN2C(=O)S\C(=C\C=C\c3ccccc3)C2=O)cc1
InChI Key InChIKey=NMHDSRSSYCCXAU-YFEFNIQKSA-N
Data  4 IC50
  Tab Delimited (TSV)   2D SDfile   Computed 3D by Vconf -m prep SDfile
Find this compound or compounds like it in BindingDB:
Activity Spreadsheet -- Enzyme Inhibition Constant Data from BindingDB
Found 4 hits for monomerid = 61649
TargetG-protein coupled receptor 35(Homo sapiens (Human))
Burnham Center For Chemical Genomics
Curated by PubChem BioAssay
LigandPNGBDBM61649(4-[4-[(5E)-2,4-bis(oxidanylidene)-5-[(E)-3-phenylp...)
Affinity DataIC50:  500nM. Assay description: Data Source: Sanford-Burnham Center for Chemical Genomics (SBCCG) Source Affiliation: Sanford-Burnham Medical Research Institute (SBMRI, San Diego, C...
In DepthDetails PCBioAssay
TargetG-protein coupled receptor 35(Homo sapiens (Human))
Burnham Center For Chemical Genomics
Curated by PubChem BioAssay
LigandPNGBDBM61649(4-[4-[(5E)-2,4-bis(oxidanylidene)-5-[(E)-3-phenylp...)
Affinity DataIC50:  1.17E+3nM. Assay description: Data Source: Dr. Mary Abood Source Affiliation: Temple University Network: NIH Molecular Libraries Probe Production Centers Network (MLPCN) Grant Pro...
In DepthDetails PCBioAssay
TargetNucleotide-binding oligomerization domain-containing protein 1(Homo sapiens (Human))
Burnham Center For Chemical Genomics
Curated by PubChem BioAssay
LigandPNGBDBM61649(4-[4-[(5E)-2,4-bis(oxidanylidene)-5-[(E)-3-phenylp...)
Affinity DataIC50:  1.17E+3nM. Assay description: Data Source: Sanford-Burnham Center for Chemical Genomics Source Affiliation: Sanford-Burnham Medical Research Institute Network: NIH Molecular Lib...
In DepthDetails PCBioAssay
TargetG-protein coupled receptor 55(Homo sapiens (Human))
Burnham Center For Chemical Genomics
Curated by PubChem BioAssay
LigandPNGBDBM61649(4-[4-[(5E)-2,4-bis(oxidanylidene)-5-[(E)-3-phenylp...)
Affinity DataIC50:  1.99E+4nM. Assay description: Data Source: Sanford-Burnham Center for Chemical Genomics(SSBCCG) Source Affiliation: Sanford-Burnham Medical Research Institute(SBMRI, San Diego, C...
In DepthDetails PCBioAssay