BDBM61707 5-[(5-cyclohexylsulfanylfuran-2-yl)methylidene]-1,3-diazinane-2,4,6-trione::5-[[5-(cyclohexylthio)-2-furanyl]methylidene]-1,3-diazinane-2,4,6-trione::5-[[5-(cyclohexylthio)-2-furyl]methylene]barbituric acid::5-{[5-(cyclohexylthio)-2-furyl]methylene}pyrimidine-2,4,6(1H,3H,5H)-trione::MLS000730984::SMR000309359::cid_16195600
SMILES O=[#6]-1-[#7]-[#6](=O)\[#6](=[#6]/c2ccc(-[#16]-[#6]-3-[#6]-[#6]-[#6]-[#6]-[#6]-3)o2)-[#6](=O)-[#7]-1
InChI Key InChIKey=FWKDJZICUNRHMG-UHFFFAOYSA-N
Data  3 IC50  1 EC50
  Tab Delimited (TSV)   2D SDfile   Computed 3D by Vconf -m prep SDfile
Find this compound or compounds like it in BindingDB:
Activity Spreadsheet -- Enzyme Inhibition Constant Data from BindingDB
Found 4 hits for monomerid = 61707
TargetVoltage-dependent N-type calcium channel subunit alpha-1B(Homo sapiens (Human))
Burnham Center For Chemical Genomics
Curated by PubChem BioAssay
LigandPNGBDBM61707(5-[(5-cyclohexylsulfanylfuran-2-yl)methylidene]-1,...)
Affinity DataIC50:  1.45E+4nM. Assay description: Data Source: Data Source: Sanford-Burnham Center for Chemical Genomics (SBCCG) Source Affiliation: Sanford-Burnham Medical Research Institute Network...
In DepthDetails PCBioAssay
TargetMelanocortin receptor 4(Homo sapiens (Human))
The Scripps Research Institute Molecular Screening Center
Curated by PubChem BioAssay
LigandPNGBDBM61707(5-[(5-cyclohexylsulfanylfuran-2-yl)methylidene]-1,...)
Affinity DataIC50: >2.15E+4nM. Assay description: Source (MLPCN Center Name): The Scripps Research Institute Molecular Screening Center (SRISMC) Center Affiliation: The Scripps Research Institute, TS...
In DepthDetails PCBioAssay
TargetCarboxy-terminal domain RNA polymerase II polypeptide A small phosphatase 1(Homo sapiens (Human))
Burnham Center For Chemical Genomics
Curated by PubChem BioAssay
LigandPNGBDBM61707(5-[(5-cyclohexylsulfanylfuran-2-yl)methylidene]-1,...)
Affinity DataIC50:  5.67E+3nM. Assay description: Data Source: Sanford-Burnham Center for Chemical Genomics (SBCCG) Source Affiliation: Sanford-Burnham Medical Research Institute (SBMRI, San Diego, C...
In DepthDetails PCBioAssay
TargetNeurotensin receptor type 1(Homo sapiens (Human))
Burnham Center For Chemical Genomics
Curated by PubChem BioAssay
LigandPNGBDBM61707(5-[(5-cyclohexylsulfanylfuran-2-yl)methylidene]-1,...)
Affinity DataEC50:  1.27E+4nM. Assay description: Data Source: Sanford-Burnham Center for Chemical Genomics (SBCCG) Source Affiliation: Sanford-Burnham Medical Research Institute (SBMRI, San Diego, C...
In DepthDetails PCBioAssay