BDBM61808 2-(4-{[2-(4-hydroxyphenyl)ethyl]amino}-3-nitrophenyl)-3a,4,7,7a-tetrahydro-1H-isoindole-1,3(2H)-dione::2-[4-[2-(4-hydroxyphenyl)ethylamino]-3-nitro-phenyl]-3a,4,7,7a-tetrahydroisoindole-1,3-dione::2-[4-[2-(4-hydroxyphenyl)ethylamino]-3-nitro-phenyl]-3a,4,7,7a-tetrahydroisoindole-1,3-quinone::2-[4-[2-(4-hydroxyphenyl)ethylamino]-3-nitrophenyl]-3a,4,7,7a-tetrahydroisoindole-1,3-dione::MLS000586657::SMR000208036::cid_12004459
SMILES Oc1c2CC=CCc2c(O)n1-c1ccc(NCCc2ccc(O)cc2)c(c1)[N+]([O-])=O
InChI Key InChIKey=BZMXADDIAJHEFD-UHFFFAOYSA-N
Data  2 EC50
  Tab Delimited (TSV)   2D SDfile   Computed 3D by Vconf -m prep SDfile
Find this compound or compounds like it in BindingDB:
Activity Spreadsheet -- Enzyme Inhibition Constant Data from BindingDB
Found 2 hits for monomerid = 61808
TargetNeuropeptide Y receptor type 1(Homo sapiens (Human))
The Scripps Research Institute Molecular Screening Center
Curated by PubChem BioAssay
LigandPNGBDBM61808(2-(4-{[2-(4-hydroxyphenyl)ethyl]amino}-3-nitrophen...)
Affinity DataEC50:  2.65E+4nM. Assay description: Source (MLPCN Center Name): The Scripps Research Institute Molecular Screening Center (SRIMSC) Center Affiliation: The Scripps Research Institute (TS...
In DepthDetails PCBioAssay
TargetNeuropeptide Y receptor type 2(Homo sapiens (Human))
The Scripps Research Institute Molecular Screening Center
Curated by PubChem BioAssay
LigandPNGBDBM61808(2-(4-{[2-(4-hydroxyphenyl)ethyl]amino}-3-nitrophen...)
Affinity DataEC50: >3.54E+4nM. Assay description: Source (MLPCN Center Name): The Scripps Research Institute Molecular Screening Center (SRIMSC) Center Affiliation: The Scripps Research Institute (TS...
In DepthDetails PCBioAssay