BDBM61813 2-(4-chlorophenyl)-N-[3-[(2-fluorophenyl)sulfamoyl]phenyl]acetamide::2-(4-chlorophenyl)-N-[3-[(2-fluorophenyl)sulfamoyl]phenyl]ethanamide::MLS000417003::SMR000241949::cid_3911588
SMILES Fc1ccccc1NS(=O)(=O)c1cccc(NC(=O)Cc2ccc(Cl)cc2)c1
InChI Key InChIKey=FWLIFCIRLOPNMG-UHFFFAOYSA-N
Data  2 EC50
  Tab Delimited (TSV)   2D SDfile   Computed 3D by Vconf -m prep SDfile
Find this compound or compounds like it in BindingDB:
Activity Spreadsheet -- Enzyme Inhibition Constant Data from BindingDB
Found 2 hits for monomerid = 61813
TargetNeuropeptide Y receptor type 1(Homo sapiens (Human))
The Scripps Research Institute Molecular Screening Center
Curated by PubChem BioAssay
LigandPNGBDBM61813(2-(4-chlorophenyl)-N-[3-[(2-fluorophenyl)sulfamoyl...)
Affinity DataEC50:  1.57E+4nM. Assay description: Source (MLPCN Center Name): The Scripps Research Institute Molecular Screening Center (SRIMSC) Center Affiliation: The Scripps Research Institute (TS...
In DepthDetails PCBioAssay
TargetNeuropeptide Y receptor type 2(Homo sapiens (Human))
The Scripps Research Institute Molecular Screening Center
Curated by PubChem BioAssay
LigandPNGBDBM61813(2-(4-chlorophenyl)-N-[3-[(2-fluorophenyl)sulfamoyl...)
Affinity DataEC50:  1.57E+4nM. Assay description: Source (MLPCN Center Name): The Scripps Research Institute Molecular Screening Center (SRIMSC) Center Affiliation: The Scripps Research Institute (TS...
In DepthDetails PCBioAssay