BDBM61832 MLS001018614::N,N-dimethyl-4-(2,4,6-triphenyl-1-pyridin-1-iumyl)aniline;perchlorate::N,N-dimethyl-4-(2,4,6-triphenylpyridin-1-ium-1-yl)aniline;perchlorate::SMR000354853::cid_16196135::dimethyl-[4-(2,4,6-triphenylpyridin-1-ium-1-yl)phenyl]amine;perchlorate
SMILES CN(C)c1ccc(cc1)-[n+]1c(cc(cc1-c1ccccc1)-c1ccccc1)-c1ccccc1
InChI Key InChIKey=XHPUYICJDOILJN-UHFFFAOYSA-N
Data  1 IC50  2 EC50
  Tab Delimited (TSV)   2D SDfile   Computed 3D by Vconf -m prep SDfile
Find this compound or compounds like it in BindingDB:
Activity Spreadsheet -- Enzyme Inhibition Constant Data from BindingDB
Found 3 hits for monomerid = 61832
TargetNeuropeptide Y receptor type 2(Homo sapiens (Human))
The Scripps Research Institute Molecular Screening Center
Curated by PubChem BioAssay
LigandPNGBDBM61832(MLS001018614 | N,N-dimethyl-4-(2,4,6-triphenyl-1-p...)
Affinity DataEC50: >3.54E+4nM. Assay description: Source (MLPCN Center Name): The Scripps Research Institute Molecular Screening Center (SRIMSC) Center Affiliation: The Scripps Research Institute (TS...
In DepthDetails PCBioAssay
TargetMitochondrial import inner membrane translocase subunit TIM10(Saccharomyces cerevisiae S288c)
Burnham Center For Chemical Genomics
Curated by PubChem BioAssay
LigandPNGBDBM61832(MLS001018614 | N,N-dimethyl-4-(2,4,6-triphenyl-1-p...)
Affinity DataIC50:  2.37E+4nM. Assay description: Data Source: Sanford-Burnham Center for Chemical Genomics (SBCCG) Source Affiliation: Sanford-Burnham Medical Research Institute(SBMRI, San Diego, CA...
In DepthDetails PCBioAssay
TargetNeuropeptide Y receptor type 1(Homo sapiens (Human))
The Scripps Research Institute Molecular Screening Center
Curated by PubChem BioAssay
LigandPNGBDBM61832(MLS001018614 | N,N-dimethyl-4-(2,4,6-triphenyl-1-p...)
Affinity DataEC50:  2.44E+4nM. Assay description: Source (MLPCN Center Name): The Scripps Research Institute Molecular Screening Center (SRIMSC) Center Affiliation: The Scripps Research Institute (TS...
In DepthDetails PCBioAssay