BDBM61890 MLS001097823::N-(6-amino-2,4-diketo-1-propyl-pyrimidin-5-yl)-N-butyl-3-pyrrol-1-yl-benzamide::N-(6-amino-2,4-dioxo-1-propyl-5-pyrimidinyl)-N-butyl-3-(1-pyrrolyl)benzamide::N-(6-amino-2,4-dioxo-1-propylpyrimidin-5-yl)-N-butyl-3-pyrrol-1-ylbenzamide::N-[6-azanyl-2,4-bis(oxidanylidene)-1-propyl-pyrimidin-5-yl]-N-butyl-3-pyrrol-1-yl-benzamide::SMR000708805::cid_24686892
SMILES CCCCN(C(=O)c1cccc(c1)-n1cccc1)c1c(N)n(CCC)c(=O)[nH]c1=O
InChI Key InChIKey=SEGRDOJPCROHCV-UHFFFAOYSA-N
Data  2 IC50
  Tab Delimited (TSV)   2D SDfile   Computed 3D by Vconf -m prep SDfile
Find this compound or compounds like it in BindingDB:
Activity Spreadsheet -- Enzyme Inhibition Constant Data from BindingDB
Found 2 hits for monomerid = 61890
TargetBcl-2-like protein 1(Homo sapiens (Human))
The Scripps Research Institute Molecular Screening Center
Curated by PubChem BioAssay
LigandPNGBDBM61890(MLS001097823 | N-(6-amino-2,4-diketo-1-propyl-pyri...)
Affinity DataIC50:  1.09E+5nM. Assay description: Source (MLPCN Center Name): The Scripps Research Institute Molecular Screening Center Affiliation: The Scripps Research Institute, TSRI Assay Provide...
In DepthDetails PCBioAssay
TargetInduced myeloid leukemia cell differentiation protein Mcl-1(Homo sapiens (Human))
The Scripps Research Institute Molecular Screening Center
Curated by PubChem BioAssay
LigandPNGBDBM61890(MLS001097823 | N-(6-amino-2,4-diketo-1-propyl-pyri...)
Affinity DataIC50: >1.21E+4nM. Assay description: Source (MLPCN Center Name): The Scripps Research Institute Molecular Screening Center Affiliation: The Scripps Research Institute, TSRI Assay Provide...
In DepthDetails PCBioAssay