BDBM61919 5-fluoranyl-N-phenyl-2-sulfanyl-benzamide::5-fluoro-2-mercapto-N-phenyl-benzamide::5-fluoro-2-mercapto-N-phenylbenzamide::5-fluoro-N-phenyl-2-sulfanylbenzamide::KSC-6-104-P2::KUC103870N::cid_44543524
SMILES Fc1ccc(S)c(c1)C(=O)Nc1ccccc1
InChI Key InChIKey=YOGWMQWWFJRYEW-UHFFFAOYSA-N
Data  2 IC50
  Tab Delimited (TSV)   2D SDfile   Computed 3D by Vconf -m prep SDfile
Find this compound or compounds like it in BindingDB:
Activity Spreadsheet -- Enzyme Inhibition Constant Data from BindingDB
Found 2 hits for monomerid = 61919
TargetPhosphotransferase(Trypanosoma brucei)
University Of Pittsburgh
Curated by PubChem BioAssay
LigandPNGBDBM61919(5-fluoranyl-N-phenyl-2-sulfanyl-benzamide | 5-fluo...)
Affinity DataIC50:  2.50E+4nM. Assay description: Excerpt from MH0882340 application (Dr. James Morris, Clemson University) Trypanosoma brucei, the digenic protozoan parasite that causes African slee...
Ligand InfoPC cidPC sid
In DepthDetails PCBioAssay
TargetGlucose-6-phosphate 1-dehydrogenase(Leuconostoc mesenteroides)
University Of Pittsburgh
Curated by PubChem BioAssay
LigandPNGBDBM61919(5-fluoranyl-N-phenyl-2-sulfanyl-benzamide | 5-fluo...)
Affinity DataIC50: >2.50E+4nM. Assay description: Excerpt from MH082340 application (Dr. James Morris, Clemson University) Trypanosoma brucei, the digenic protozoan parasite that causes African sleep...
Ligand InfoPC cidPC sid
In DepthDetails PCBioAssay