BDBM61925 2-(3-keto-1,2-benzothiazol-2-yl)-N-phenyl-acetamide::2-(3-oxidanylidene-1,2-benzothiazol-2-yl)-N-phenyl-ethanamide::2-(3-oxo-1,2-benzothiazol-2-yl)-N-phenylacetamide::KSC-4-244::KUC104122N::cid_44602374
SMILES O=C(Cn1sc2ccccc2c1=O)Nc1ccccc1
InChI Key InChIKey=OCAUOKFPSQKCAA-UHFFFAOYSA-N
Data  3 IC50
  Tab Delimited (TSV)   2D SDfile   Computed 3D by Vconf -m prep SDfile
Find this compound or compounds like it in BindingDB:
Activity Spreadsheet -- Enzyme Inhibition Constant Data from BindingDB
Found 3 hits for monomerid = 61925
TargetGlucose-6-phosphate 1-dehydrogenase(Leuconostoc mesenteroides)
University Of Pittsburgh
Curated by PubChem BioAssay
LigandPNGBDBM61925(2-(3-keto-1,2-benzothiazol-2-yl)-N-phenyl-acetamid...)
Affinity DataIC50: >2.50E+4nM. Assay description: Excerpt from MH082340 application (Dr. James Morris, Clemson University) Trypanosoma brucei, the digenic protozoan parasite that causes African sleep...
In DepthDetails PCBioAssay
TargetReplicase polyprotein 1ab(2019-nCoV)
Nanjing University Of Chinese Medicine
Curated by ChEMBL
LigandPNGBDBM61925(2-(3-keto-1,2-benzothiazol-2-yl)-N-phenyl-acetamid...)
Affinity DataIC50:  165nM. Assay description: Inhibition of SARS-CoV-2 main protease using Mca-AVLQSGFRK(Dnp)K as substrate preincubated with enzyme for 10 mins followed by substrate addition and...
In DepthDetails PubMed
TargetPhosphotransferase(Trypanosoma brucei)
University Of Pittsburgh
Curated by PubChem BioAssay
LigandPNGBDBM61925(2-(3-keto-1,2-benzothiazol-2-yl)-N-phenyl-acetamid...)
Affinity DataIC50:  6.69E+3nM. Assay description: Excerpt from MH0882340 application (Dr. James Morris, Clemson University) Trypanosoma brucei, the digenic protozoan parasite that causes African slee...
In DepthDetails PCBioAssay