BDBM61928 KSC-4-252::KUC104127N::N-(4-bromophenyl)-2-(3-keto-1,2-benzothiazol-2-yl)acetamide::N-(4-bromophenyl)-2-(3-oxidanylidene-1,2-benzothiazol-2-yl)ethanamide::N-(4-bromophenyl)-2-(3-oxo-1,2-benzothiazol-2-yl)acetamide::cid_44602376
SMILES Brc1ccc(NC(=O)Cn2sc3ccccc3c2=O)cc1
InChI Key InChIKey=CKRADAOJYXHLJA-UHFFFAOYSA-N
Data  4 IC50
  Tab Delimited (TSV)   2D SDfile   Computed 3D by Vconf -m prep SDfile
Find this compound or compounds like it in BindingDB:
Activity Spreadsheet -- Enzyme Inhibition Constant Data from BindingDB
Found 4 hits for monomerid = 61928
TargetGlucose-6-phosphate 1-dehydrogenase(Leuconostoc mesenteroides)
University Of Pittsburgh
Curated by PubChem BioAssay
LigandPNGBDBM61928(KSC-4-252 | KUC104127N | N-(4-bromophenyl)-2-(3-ke...)
Affinity DataIC50: >2.50E+4nM. Assay description: Excerpt from MH082340 application (Dr. James Morris, Clemson University) Trypanosoma brucei, the digenic protozoan parasite that causes African sleep...
In DepthDetails PCBioAssay
TargetReceptor-interacting serine/threonine-protein kinase 2(Homo sapiens (Human))
The Scripps Research Institute Molecular Screening Center
Curated by PubChem BioAssay
LigandPNGBDBM61928(KSC-4-252 | KUC104127N | N-(4-bromophenyl)-2-(3-ke...)
Affinity DataIC50:  1.02E+4nM
In DepthDetails PCBioAssay
TargetBeta-lactamase(Pseudomonas aeruginosa)
The Scripps Research Institute Molecular Screening Center
Curated by PubChem BioAssay
LigandPNGBDBM61928(KSC-4-252 | KUC104127N | N-(4-bromophenyl)-2-(3-ke...)
Affinity DataIC50: >4.98E+4nM
In DepthDetails PCBioAssay
TargetPhosphotransferase(Trypanosoma brucei)
University Of Pittsburgh
Curated by PubChem BioAssay
LigandPNGBDBM61928(KSC-4-252 | KUC104127N | N-(4-bromophenyl)-2-(3-ke...)
Affinity DataIC50:  2.50E+4nM. Assay description: Excerpt from MH0882340 application (Dr. James Morris, Clemson University) Trypanosoma brucei, the digenic protozoan parasite that causes African slee...
In DepthDetails PCBioAssay