BDBM61963 KSC-09-140D::KUC105612N::N-benzyl-2-(3-keto-1,2-benzothiazol-2-yl)-N-methyl-acetamide::N-benzyl-N-methyl-2-(3-oxo-1,2-benzothiazol-2-yl)acetamide::N-methyl-2-(3-oxidanylidene-1,2-benzothiazol-2-yl)-N-(phenylmethyl)ethanamide::N-methyl-2-(3-oxo-1,2-benzothiazol-2-yl)-N-(phenylmethyl)acetamide::cid_45256185
SMILES CN(Cc1ccccc1)C(=O)Cn1sc2ccccc2c1=O
InChI Key InChIKey=ANTPCIKREGVPQT-UHFFFAOYSA-N
Data  2 IC50
  Tab Delimited (TSV)   2D SDfile   Computed 3D by Vconf -m prep SDfile
Find this compound or compounds like it in BindingDB:
Activity Spreadsheet -- Enzyme Inhibition Constant Data from BindingDB
Found 2 hits for monomerid = 61963
TargetPhosphotransferase(Trypanosoma brucei)
University Of Pittsburgh
Curated by PubChem BioAssay
LigandPNGBDBM61963(KSC-09-140D | KUC105612N | N-benzyl-2-(3-keto-1,2-...)
Affinity DataIC50:  7.87E+3nM. Assay description: Excerpt from MH0882340 application (Dr. James Morris, Clemson University) Trypanosoma brucei, the digenic protozoan parasite that causes African slee...
In DepthDetails PCBioAssay
TargetGlucose-6-phosphate 1-dehydrogenase(Leuconostoc mesenteroides)
University Of Pittsburgh
Curated by PubChem BioAssay
LigandPNGBDBM61963(KSC-09-140D | KUC105612N | N-benzyl-2-(3-keto-1,2-...)
Affinity DataIC50: >2.50E+4nM. Assay description: Excerpt from MH082340 application (Dr. James Morris, Clemson University) Trypanosoma brucei, the digenic protozoan parasite that causes African sleep...
In DepthDetails PCBioAssay