BDBM61975 2-[(4-methoxyphenyl)carbamoylamino]benzoic acid::2-[[(4-methoxyanilino)-oxomethyl]amino]benzoic acid::KSC-6-243::KUC105625N::cid_4128510
SMILES COc1ccc(NC(=O)Nc2ccccc2C(O)=O)cc1
InChI Key InChIKey=ZFHPJWWTGIZRLR-UHFFFAOYSA-N
Data  2 IC50
  Tab Delimited (TSV)   2D SDfile   Computed 3D by Vconf -m prep SDfile
Find this compound or compounds like it in BindingDB:
Activity Spreadsheet -- Enzyme Inhibition Constant Data from BindingDB
Found 2 hits for monomerid = 61975
TargetPhosphotransferase(Trypanosoma brucei)
University Of Pittsburgh
Curated by PubChem BioAssay
LigandPNGBDBM61975(2-[(4-methoxyphenyl)carbamoylamino]benzoic acid | ...)
Affinity DataIC50:  2.50E+4nM. Assay description: Excerpt from MH0882340 application (Dr. James Morris, Clemson University) Trypanosoma brucei, the digenic protozoan parasite that causes African slee...
In DepthDetails PCBioAssay
TargetGlucose-6-phosphate 1-dehydrogenase(Leuconostoc mesenteroides)
University Of Pittsburgh
Curated by PubChem BioAssay
LigandPNGBDBM61975(2-[(4-methoxyphenyl)carbamoylamino]benzoic acid | ...)
Affinity DataIC50: >2.50E+4nM. Assay description: Excerpt from MH082340 application (Dr. James Morris, Clemson University) Trypanosoma brucei, the digenic protozoan parasite that causes African sleep...
In DepthDetails PCBioAssay