BDBM61982 3-(p-anisoylamino)isonicotinic acid::3-[(4-methoxybenzoyl)amino]pyridine-4-carboxylic acid::3-[(4-methoxyphenyl)carbonylamino]pyridine-4-carboxylic acid::3-[[(4-methoxyphenyl)-oxomethyl]amino]-4-pyridinecarboxylic acid::KSC-6-258::KUC105714N::cid_45489601
SMILES COc1ccc(cc1)C(=O)Nc1cnccc1C(O)=O
InChI Key InChIKey=DOLQEAANPDFGED-UHFFFAOYSA-N
Data  2 IC50
  Tab Delimited (TSV)   2D SDfile   Computed 3D by Vconf -m prep SDfile
Find this compound or compounds like it in BindingDB:
Activity Spreadsheet -- Enzyme Inhibition Constant Data from BindingDB
Found 2 hits for monomerid = 61982
TargetPhosphotransferase(Trypanosoma brucei)
University Of Pittsburgh
Curated by PubChem BioAssay
LigandPNGBDBM61982(3-(p-anisoylamino)isonicotinic acid | 3-[(4-methox...)
Affinity DataIC50:  2.50E+4nM. Assay description: Excerpt from MH0882340 application (Dr. James Morris, Clemson University) Trypanosoma brucei, the digenic protozoan parasite that causes African slee...
In DepthDetails PCBioAssay
TargetGlucose-6-phosphate 1-dehydrogenase(Leuconostoc mesenteroides)
University Of Pittsburgh
Curated by PubChem BioAssay
LigandPNGBDBM61982(3-(p-anisoylamino)isonicotinic acid | 3-[(4-methox...)
Affinity DataIC50: >2.50E+4nM. Assay description: Excerpt from MH082340 application (Dr. James Morris, Clemson University) Trypanosoma brucei, the digenic protozoan parasite that causes African sleep...
In DepthDetails PCBioAssay